BDBM50332249 (E)-6-Naphthalen-2-yl-4-oxohex-5-enoic acid(4-hydroxyphenyl)-amide::CHEMBL1288148
SMILES: Oc1ccc(NC(=O)CCC(=O)C=Cc2ccc3ccccc3c2)cc1
InChI Key: InChIKey=YKCGVZLOUWPCIB-UHFFFAOYSA-N
Data: 2 KI  2 IC50
Activity Spreadsheet -- Enzyme Inhibition Constant Data from BindingDB
Found 4 hits for monomerid = 50332249
Trg + Lig
Ki
nM
ΔG°
kcal/mole
IC50
nM
Kd
nM
EC50/IC50
nM
koff
s-1
kon
M-1s-1
pHTemp
°C
Cannabinoid receptor 2
(Homo sapiens (Human))
BDBM50332249
((E)-6-Naphthalen-2-yl-4-oxohex-5-enoic acid(4-hydr...)
Show SMILES Oc1ccc(NC(=O)CCC(=O)C=Cc2ccc3ccccc3c2)cc1 |w:13.13|
Show InChI InChI=1S/C22H19NO3/c24-20(13-14-22(26)23-19-8-11-21(25)12-9-19)10-6-16-5-7-17-3-1-2-4-18(17)15-16/h1-12,15,25H,13-14H2,(H,23,26)
Reactome pathway
>1.00E+4n/an/an/an/an/an/an/an/a
German University in Cairo
Curated by ChEMBL
Assay Description
Displacement of [3H]-CP-55940 from human recombinant CB2 receptor expressed in HEK293 cells
Bioorg Med Chem 18: 8463-77 (2010)
Article DOI: 10.1016/j.bmc.2010.10.050
BindingDB Entry DOI: 10.7270/Q2319W4V
Cannabinoid receptor 1
(Homo sapiens (Human))
BDBM50332249
((E)-6-Naphthalen-2-yl-4-oxohex-5-enoic acid(4-hydr...)
Show SMILES Oc1ccc(NC(=O)CCC(=O)C=Cc2ccc3ccccc3c2)cc1 |w:13.13|
Show InChI InChI=1S/C22H19NO3/c24-20(13-14-22(26)23-19-8-11-21(25)12-9-19)10-6-16-5-7-17-3-1-2-4-18(17)15-16/h1-12,15,25H,13-14H2,(H,23,26)
NCI pathway
Reactome pathway
>1.00E+4n/an/an/an/an/an/an/an/a
German University in Cairo
Curated by ChEMBL
Assay Description
Displacement of [3H]-CP-55940 from human recombinant CB1 receptor expressed in HEK293 cells
Bioorg Med Chem 18: 8463-77 (2010)
Article DOI: 10.1016/j.bmc.2010.10.050
BindingDB Entry DOI: 10.7270/Q2319W4V
Cannabinoid receptor 1
(Homo sapiens (Human))
BDBM50332249
((E)-6-Naphthalen-2-yl-4-oxohex-5-enoic acid(4-hydr...)
Show SMILES Oc1ccc(NC(=O)CCC(=O)C=Cc2ccc3ccccc3c2)cc1 |w:13.13|
Show InChI InChI=1S/C22H19NO3/c24-20(13-14-22(26)23-19-8-11-21(25)12-9-19)10-6-16-5-7-17-3-1-2-4-18(17)15-16/h1-12,15,25H,13-14H2,(H,23,26)
NCI pathway
Reactome pathway
n/an/a>1.00E+4n/an/an/an/an/an/a
German University in Cairo
Curated by ChEMBL
Assay Description
Displacement of [3H]-CP-55940 from human recombinant CB1 receptor expressed in HEK293 cells
Bioorg Med Chem 18: 8463-77 (2010)
Article DOI: 10.1016/j.bmc.2010.10.050
BindingDB Entry DOI: 10.7270/Q2319W4V
Cannabinoid receptor 2
(Homo sapiens (Human))
BDBM50332249
((E)-6-Naphthalen-2-yl-4-oxohex-5-enoic acid(4-hydr...)
Show SMILES Oc1ccc(NC(=O)CCC(=O)C=Cc2ccc3ccccc3c2)cc1 |w:13.13|
Show InChI InChI=1S/C22H19NO3/c24-20(13-14-22(26)23-19-8-11-21(25)12-9-19)10-6-16-5-7-17-3-1-2-4-18(17)15-16/h1-12,15,25H,13-14H2,(H,23,26)
Reactome pathway
n/an/a>1.00E+4n/an/an/an/an/an/a
German University in Cairo
Curated by ChEMBL
Assay Description
Displacement of [3H]-CP-55940 from human recombinant CB2 receptor expressed in HEK293 cells
Bioorg Med Chem 18: 8463-77 (2010)
Article DOI: 10.1016/j.bmc.2010.10.050
BindingDB Entry DOI: 10.7270/Q2319W4V