BDBM50332973 7-methyl-4-(3-(3-methylisoxazol-5-yl)phenyl)-8-(trifluoromethyl)-1H-benzo[b][1,4]diazepin-2(3H)-one::CHEMBL1631757
SMILES: Cc1cc(on1)-c1cccc(c1)C1=Nc2cc(C)c(cc2NC(=O)C1)C(F)(F)F
InChI Key: InChIKey=KSFDHAWWRWUGAG-UHFFFAOYSA-N
Data: 2 IC50
Activity Spreadsheet -- Enzyme Inhibition Constant Data from BindingDB
Found 2 hits for monomerid = 50332973
Trg + Lig
Ki
nM
ΔG°
kcal/mole
IC50
nM
Kd
nM
EC50/IC50
nM
koff
s-1
kon
M-1s-1
pHTemp
°C
Metabotropic glutamate receptor 2
(Homo sapiens (Human))
BDBM50332973
(7-methyl-4-(3-(3-methylisoxazol-5-yl)phenyl)-8-(tr...)
Show SMILES Cc1cc(on1)-c1cccc(c1)C1=Nc2cc(C)c(cc2NC(=O)C1)C(F)(F)F |t:14|
Show InChI InChI=1S/C21H16F3N3O2/c1-11-6-17-18(9-15(11)21(22,23)24)26-20(28)10-16(25-17)13-4-3-5-14(8-13)19-7-12(2)27-29-19/h3-9H,10H2,1-2H3,(H,26,28)
n/an/a 9n/an/an/an/an/an/a
F. Hoffmann-La Roche Ltd
Curated by ChEMBL
Assay Description
Antagonist activity at recombinant rat mGluR2 expressed in forskolin-stimulated CHO cells assessed as inhibition of (1S,3R)-ACPD induced cAMP product...
Bioorg Med Chem Lett 20: 6969-74 (2010)
Article DOI: 10.1016/j.bmcl.2010.09.125
BindingDB Entry DOI: 10.7270/Q2X63N6R
Metabotropic glutamate receptor 2
(Homo sapiens (Human))
BDBM50332973
(7-methyl-4-(3-(3-methylisoxazol-5-yl)phenyl)-8-(tr...)
Show SMILES Cc1cc(on1)-c1cccc(c1)C1=Nc2cc(C)c(cc2NC(=O)C1)C(F)(F)F |t:14|
Show InChI InChI=1S/C21H16F3N3O2/c1-11-6-17-18(9-15(11)21(22,23)24)26-20(28)10-16(25-17)13-4-3-5-14(8-13)19-7-12(2)27-29-19/h3-9H,10H2,1-2H3,(H,26,28)
n/an/a 5n/an/an/an/an/an/a
F. Hoffmann-La Roche Ltd
Curated by ChEMBL
Assay Description
Partial displacement of [3H]LY354740 from recombinant rat mGluR2
Bioorg Med Chem Lett 20: 6969-74 (2010)
Article DOI: 10.1016/j.bmcl.2010.09.125
BindingDB Entry DOI: 10.7270/Q2X63N6R