BDBM50332975 4-(3-(2-ethylpyridin-4-yl)phenyl)-7-methyl-8-(trifluoromethyl)-1H-benzo[b][1,4]diazepin-2(3H)-one::CHEMBL1631860
SMILES: CCc1cc(ccn1)-c1cccc(c1)C1=Nc2cc(C)c(cc2NC(=O)C1)C(F)(F)F
InChI Key: InChIKey=CHTAULFZQPVWNJ-UHFFFAOYSA-N
Data: 2 IC50
Activity Spreadsheet -- Enzyme Inhibition Constant Data from BindingDB
Found 2 hits for monomerid = 50332975
Trg + Lig
Ki
nM
ΔG°
kcal/mole
IC50
nM
Kd
nM
EC50/IC50
nM
koff
s-1
kon
M-1s-1
pHTemp
°C
Metabotropic glutamate receptor 2
(Homo sapiens (Human))
BDBM50332975
(4-(3-(2-ethylpyridin-4-yl)phenyl)-7-methyl-8-(trif...)
Show SMILES CCc1cc(ccn1)-c1cccc(c1)C1=Nc2cc(C)c(cc2NC(=O)C1)C(F)(F)F |t:16|
Show InChI InChI=1S/C24H20F3N3O/c1-3-18-11-16(7-8-28-18)15-5-4-6-17(10-15)20-13-23(31)30-22-12-19(24(25,26)27)14(2)9-21(22)29-20/h4-12H,3,13H2,1-2H3,(H,30,31)
n/an/a 8n/an/an/an/an/an/a
F. Hoffmann-La Roche Ltd
Curated by ChEMBL
Assay Description
Partial displacement of [3H]LY354740 from recombinant rat mGluR2
Bioorg Med Chem Lett 20: 6969-74 (2010)
Article DOI: 10.1016/j.bmcl.2010.09.125
BindingDB Entry DOI: 10.7270/Q2X63N6R
Metabotropic glutamate receptor 2
(Homo sapiens (Human))
BDBM50332975
(4-(3-(2-ethylpyridin-4-yl)phenyl)-7-methyl-8-(trif...)
Show SMILES CCc1cc(ccn1)-c1cccc(c1)C1=Nc2cc(C)c(cc2NC(=O)C1)C(F)(F)F |t:16|
Show InChI InChI=1S/C24H20F3N3O/c1-3-18-11-16(7-8-28-18)15-5-4-6-17(10-15)20-13-23(31)30-22-12-19(24(25,26)27)14(2)9-21(22)29-20/h4-12H,3,13H2,1-2H3,(H,30,31)
n/an/a 5n/an/an/an/an/an/a
F. Hoffmann-La Roche Ltd
Curated by ChEMBL
Assay Description
Antagonist activity at recombinant rat mGluR2 expressed in forskolin-stimulated CHO cells assessed as inhibition of (1S,3R)-ACPD induced cAMP product...
Bioorg Med Chem Lett 20: 6969-74 (2010)
Article DOI: 10.1016/j.bmcl.2010.09.125
BindingDB Entry DOI: 10.7270/Q2X63N6R