BDBM50332985 4-(3-(1H-1,2,4-triazol-1-yl)phenyl)-7-methyl-8-(trifluoromethyl)-1H-benzo[b][1,4]diazepin-2(3H)-one::CHEMBL1631854
SMILES: Cc1cc2N=C(CC(=O)Nc2cc1C(F)(F)F)c1cccc(c1)-n1cncn1
InChI Key: InChIKey=ILOJIYYHDKPLLX-UHFFFAOYSA-N
Data: 2 IC50
Activity Spreadsheet -- Enzyme Inhibition Constant Data from BindingDB
Found 2 hits for monomerid = 50332985
Trg + Lig
Ki
nM
ΔG°
kcal/mole
IC50
nM
Kd
nM
EC50/IC50
nM
koff
s-1
kon
M-1s-1
pHTemp
°C
Metabotropic glutamate receptor 2
(Homo sapiens (Human))
BDBM50332985
(4-(3-(1H-1,2,4-triazol-1-yl)phenyl)-7-methyl-8-(tr...)
Show SMILES Cc1cc2N=C(CC(=O)Nc2cc1C(F)(F)F)c1cccc(c1)-n1cncn1 |c:4|
Show InChI InChI=1S/C19H14F3N5O/c1-11-5-16-17(7-14(11)19(20,21)22)26-18(28)8-15(25-16)12-3-2-4-13(6-12)27-10-23-9-24-27/h2-7,9-10H,8H2,1H3,(H,26,28)
n/an/a 75n/an/an/an/an/an/a
F. Hoffmann-La Roche Ltd
Curated by ChEMBL
Assay Description
Antagonist activity at recombinant rat mGluR2 expressed in forskolin-stimulated CHO cells assessed as inhibition of (1S,3R)-ACPD induced cAMP product...
Bioorg Med Chem Lett 20: 6969-74 (2010)
Article DOI: 10.1016/j.bmcl.2010.09.125
BindingDB Entry DOI: 10.7270/Q2X63N6R
Metabotropic glutamate receptor 2
(Homo sapiens (Human))
BDBM50332985
(4-(3-(1H-1,2,4-triazol-1-yl)phenyl)-7-methyl-8-(tr...)
Show SMILES Cc1cc2N=C(CC(=O)Nc2cc1C(F)(F)F)c1cccc(c1)-n1cncn1 |c:4|
Show InChI InChI=1S/C19H14F3N5O/c1-11-5-16-17(7-14(11)19(20,21)22)26-18(28)8-15(25-16)12-3-2-4-13(6-12)27-10-23-9-24-27/h2-7,9-10H,8H2,1H3,(H,26,28)
n/an/a 8n/an/an/an/an/an/a
F. Hoffmann-La Roche Ltd
Curated by ChEMBL
Assay Description
Partial displacement of [3H]LY354740 from recombinant rat mGluR2
Bioorg Med Chem Lett 20: 6969-74 (2010)
Article DOI: 10.1016/j.bmcl.2010.09.125
BindingDB Entry DOI: 10.7270/Q2X63N6R