BDBM50333096 CHEMBL1631924
SMILES: [#6]-[#6@@H](-[#8])-[#6@H](-[#7]-[#6](=O)-[#6@H](-[#6]-c1ccccc1)-[#7]-[#6](=O)-[#6]-[#7]-[#6](=O)-[#6]-[#7]-[#6](=O)-[#6@@H](-[#7])-[#6]-c1ccccc1)-[#6](=O)-[#7]-[#6]-[#6](=O)-[#7]-[#6@H]-1-[#6]-[#6]-[#6]-[#6]-[#7]-[#6](=O)-[#6]-[#6@H](-[#7]-[#6](=O)-[#6@H](-[#6]-[#6]-[#6]-[#6]-[#7])-[#7]-[#6](=O)-[#6@H](-[#6]-[#6]-[#6]\[#7]=[#6](/[#7])-[#7])-[#7]-[#6](=O)-[#6@@H]-2-[#6]-[#6](=O)-[#7]-[#6]-[#6]-[#6]-[#6]-[#6@@H](-[#6]-[#6](=O)-[#6@H](-[#6]-[#6]-[#6]-[#6]-[#7])-[#7]-[#6](=O)-[#6@H](-[#6]-[#6]-[#6]\[#7]=[#6](\[#7])-[#7])-[#7]-[#6]-1=O)-[#6](=O)-[#7]-2)-[#6](-[#7])=O
InChI Key: InChIKey=HNJLVIQPRHMPRH-RXVKJWOASA-N
Data: 1 EC50
Activity Spreadsheet -- Enzyme Inhibition Constant Data from BindingDB
Found 1 hit for monomerid = 50333096
Trg + Lig
Ki
nM
ΔG°
kcal/mole
IC50
nM
Kd
nM
EC50/IC50
nM
koff
s-1
kon
M-1s-1
pHTemp
°C
Nociceptin/Orphanin FQ, NOP receptor
(MOUSE)
BDBM50333096
(CHEMBL1631924)
Show SMILES [#6]-[#6@@H](-[#8])-[#6@H](-[#7]-[#6](=O)-[#6@H](-[#6]-c1ccccc1)-[#7]-[#6](=O)-[#6]-[#7]-[#6](=O)-[#6]-[#7]-[#6](=O)-[#6@@H](-[#7])-[#6]-c1ccccc1)-[#6](=O)-[#7]-[#6]-[#6](=O)-[#7]-[#6@H]-1-[#6]-[#6]-[#6]-[#6]-[#7]-[#6](=O)-[#6]-[#6@H](-[#7]-[#6](=O)-[#6@H](-[#6]-[#6]-[#6]-[#6]-[#7])-[#7]-[#6](=O)-[#6@H](-[#6]-[#6]-[#6]\[#7]=[#6](/[#7])-[#7])-[#7]-[#6](=O)-[#6@@H]-2-[#6]-[#6](=O)-[#7]-[#6]-[#6]-[#6]-[#6]-[#6@@H](-[#6]-[#6](=O)-[#6@H](-[#6]-[#6]-[#6]-[#6]-[#7])-[#7]-[#6](=O)-[#6@H](-[#6]-[#6]-[#6]\[#7]=[#6](\[#7])-[#7])-[#7]-[#6]-1=O)-[#6](=O)-[#7]-2)-[#6](-[#7])=O |r|
Show InChI InChI=1S/C73H116N24O17/c1-42(98)61(97-70(113)53(35-44-20-6-3-7-21-44)90-59(103)40-86-58(102)39-87-64(107)46(76)34-43-18-4-2-5-19-43)71(114)88-41-60(104)89-48-25-11-15-31-82-56(100)37-52(62(77)105)95-68(111)49(24-9-13-29-75)92-67(110)51(27-17-33-85-73(80)81)94-69(112)54-38-57(101)83-30-14-10-22-45(63(106)96-54)36-55(99)47(23-8-12-28-74)91-66(109)50(93-65(48)108)26-16-32-84-72(78)79/h2-7,18-21,42,45-54,61,98H,8-17,22-41,74-76H2,1H3,(H2,77,105)(H,82,100)(H,83,101)(H,86,102)(H,87,107)(H,88,114)(H,89,104)(H,90,103)(H,91,109)(H,92,110)(H,93,108)(H,94,112)(H,95,111)(H,96,106)(H,97,113)(H4,78,79,84)(H4,80,81,85)/t42-,45+,46+,47+,48+,49+,50+,51+,52+,53+,54+,61+/m1/s1
n/an/an/an/a 14n/an/an/an/a
TBA
Curated by ChEMBL
Assay Description
Agonist activity at NOR in mouse Neuro-2a cells assessed as stimulation of ERK phopshorylation after 30 mins post dose by Alphascreen Surefire assay
J Med Chem 53: 8400-8408 (2010)
Article DOI: 10.1021/jm101139f
BindingDB Entry DOI: 10.7270/Q24Q7V77