BDBM50333150 5-Amino-2-piperidin-1-yl-6,7,8,9-tetrahydrobenzo[1,8-b]-naphthyridine-3-carbonitrile::CHEMBL1644723
SMILES: Nc1c2CCCCc2nc2nc(N3CCCCC3)c(cc12)C#N
InChI Key: InChIKey=GAZLRMJAXHIEQV-UHFFFAOYSA-N
Data: 3 IC50
Activity Spreadsheet -- Enzyme Inhibition Constant Data from BindingDB
Found 3 hits for monomerid = 50333150
Trg + Lig
Ki
nM
ΔG°
kcal/mole
IC50
nM
Kd
nM
EC50/IC50
nM
koff
s-1
kon
M-1s-1
pHTemp
°C
Acetylcholinesterase
(Electrophorus electricus (Electric eel))
BDBM50333150
(5-Amino-2-piperidin-1-yl-6,7,8,9-tetrahydrobenzo[1...)
Show SMILES Nc1c2CCCCc2nc2nc(N3CCCCC3)c(cc12)C#N
Show InChI InChI=1S/C18H21N5/c19-11-12-10-14-16(20)13-6-2-3-7-15(13)21-17(14)22-18(12)23-8-4-1-5-9-23/h10H,1-9H2,(H2,20,21,22)
n/an/a 25n/an/an/an/an/an/a
Laboratorio de Radicales Libres y Qu�mica Computacional (IQOG, CSIC)
Curated by ChEMBL
Assay Description
Inhibition of Electrophorus electricus AChE by Ellman's method
Bioorg Med Chem 19: 122-33 (2011)
Article DOI: 10.1016/j.bmc.2010.11.040
BindingDB Entry DOI: 10.7270/Q22R3RX5
Butyrylcholinesterase (BuChE)
(Equus caballus (Horse))
BDBM50333150
(5-Amino-2-piperidin-1-yl-6,7,8,9-tetrahydrobenzo[1...)
Show SMILES Nc1c2CCCCc2nc2nc(N3CCCCC3)c(cc12)C#N
Show InChI InChI=1S/C18H21N5/c19-11-12-10-14-16(20)13-6-2-3-7-15(13)21-17(14)22-18(12)23-8-4-1-5-9-23/h10H,1-9H2,(H2,20,21,22)
n/an/a 3.60E+3n/an/an/an/an/an/a
Laboratorio de Radicales Libres y Qu�mica Computacional (IQOG, CSIC)
Curated by ChEMBL
Assay Description
Inhibition of horse serum BuChE by Ellman's method
Bioorg Med Chem 19: 122-33 (2011)
Article DOI: 10.1016/j.bmc.2010.11.040
BindingDB Entry DOI: 10.7270/Q22R3RX5
Acetylcholinesterase
(Bos taurus (bovine))
BDBM50333150
(5-Amino-2-piperidin-1-yl-6,7,8,9-tetrahydrobenzo[1...)
Show SMILES Nc1c2CCCCc2nc2nc(N3CCCCC3)c(cc12)C#N
Show InChI InChI=1S/C18H21N5/c19-11-12-10-14-16(20)13-6-2-3-7-15(13)21-17(14)22-18(12)23-8-4-1-5-9-23/h10H,1-9H2,(H2,20,21,22)
Reactome pathway
n/an/a 1.00E+3n/an/an/an/an/an/a
Laboratorio de Radicales Libres y Qu�mica Computacional (IQOG, CSIC)
Curated by ChEMBL
Assay Description
Inhibition of bovine erythrocytes AChE by Ellman's method
Bioorg Med Chem 19: 122-33 (2011)
Article DOI: 10.1016/j.bmc.2010.11.040
BindingDB Entry DOI: 10.7270/Q22R3RX5