BDBM50333494 (R)-2-(8-(4-fluoro-N-methylphenylsulfonamido)-6,7,8,9-tetrahydropyrido[3,2-b]indolizin-5-yl)acetic acid::CHEMBL1641808
SMILES: CN([C@@H]1CCc2c(CC(O)=O)c3cccnc3n2C1)S(=O)(=O)c1ccc(F)cc1
InChI Key: InChIKey=HLWCJDUVRWNSEA-CQSZACIVSA-N
Data: 3 KI  4 IC50
Activity Spreadsheet -- Enzyme Inhibition Constant Data from BindingDB
Found 7 hits for monomerid = 50333494
Trg + Lig
Ki
nM
ΔG°
kcal/mole
IC50
nM
Kd
nM
EC50/IC50
nM
koff
s-1
kon
M-1s-1
pHTemp
°C
G protein-coupled receptor 44
(Homo sapiens (Human))
BDBM50333494
((R)-2-(8-(4-fluoro-N-methylphenylsulfonamido)-6,7,...)
Show SMILES CN([C@@H]1CCc2c(CC(O)=O)c3cccnc3n2C1)S(=O)(=O)c1ccc(F)cc1 |r|
Show InChI InChI=1S/C20H20FN3O4S/c1-23(29(27,28)15-7-4-13(21)5-8-15)14-6-9-18-17(11-19(25)26)16-3-2-10-22-20(16)24(18)12-14/h2-5,7-8,10,14H,6,9,11-12H2,1H3,(H,25,26)/t14-/m1/s1
Reactome pathway
3.30n/an/an/an/an/an/an/an/a
Merck Frosst Centre for Therapeutic Research
Curated by ChEMBL
Assay Description
Displacement of radioligand from human CRTH2 expressed in HEK293 cells by competitive binding assay
Bioorg Med Chem Lett 21: 841-5 (2011)
Article DOI: 10.1016/j.bmcl.2010.11.084
BindingDB Entry DOI: 10.7270/Q24J0FCP
Prostanoid TP receptor
(Homo sapiens (Human))
BDBM50333494
((R)-2-(8-(4-fluoro-N-methylphenylsulfonamido)-6,7,...)
Show SMILES CN([C@@H]1CCc2c(CC(O)=O)c3cccnc3n2C1)S(=O)(=O)c1ccc(F)cc1 |r|
Show InChI InChI=1S/C20H20FN3O4S/c1-23(29(27,28)15-7-4-13(21)5-8-15)14-6-9-18-17(11-19(25)26)16-3-2-10-22-20(16)24(18)12-14/h2-5,7-8,10,14H,6,9,11-12H2,1H3,(H,25,26)/t14-/m1/s1
>2.20E+4n/an/an/an/an/an/an/an/a
Merck Frosst Centre for Therapeutic Research
Curated by ChEMBL
Assay Description
Displacement of radioligand from prostanoid TP receptor expressed in HEK293 cells by competitive binding assay
Bioorg Med Chem Lett 21: 841-5 (2011)
Article DOI: 10.1016/j.bmcl.2010.11.084
BindingDB Entry DOI: 10.7270/Q24J0FCP
Prostanoid DP receptor
(Homo sapiens (Human))
BDBM50333494
((R)-2-(8-(4-fluoro-N-methylphenylsulfonamido)-6,7,...)
Show SMILES CN([C@@H]1CCc2c(CC(O)=O)c3cccnc3n2C1)S(=O)(=O)c1ccc(F)cc1 |r|
Show InChI InChI=1S/C20H20FN3O4S/c1-23(29(27,28)15-7-4-13(21)5-8-15)14-6-9-18-17(11-19(25)26)16-3-2-10-22-20(16)24(18)12-14/h2-5,7-8,10,14H,6,9,11-12H2,1H3,(H,25,26)/t14-/m1/s1
>4.70E+4n/an/an/an/an/an/an/an/a
Merck Frosst Centre for Therapeutic Research
Curated by ChEMBL
Assay Description
Displacement of radioligand from prostanoid DP receptor expressed in HEK293 cells by competitive binding assay
Bioorg Med Chem Lett 21: 841-5 (2011)
Article DOI: 10.1016/j.bmcl.2010.11.084
BindingDB Entry DOI: 10.7270/Q24J0FCP
Cytochrome P450 3A4
(Homo sapiens (Human))
BDBM50333494
((R)-2-(8-(4-fluoro-N-methylphenylsulfonamido)-6,7,...)
Show SMILES CN([C@@H]1CCc2c(CC(O)=O)c3cccnc3n2C1)S(=O)(=O)c1ccc(F)cc1 |r|
Show InChI InChI=1S/C20H20FN3O4S/c1-23(29(27,28)15-7-4-13(21)5-8-15)14-6-9-18-17(11-19(25)26)16-3-2-10-22-20(16)24(18)12-14/h2-5,7-8,10,14H,6,9,11-12H2,1H3,(H,25,26)/t14-/m1/s1
Reactome pathway
n/an/a>5.00E+4n/an/an/an/an/an/a
Merck Frosst Centre for Therapeutic Research
Curated by ChEMBL
Assay Description
Inhibition of CYP3A4
Bioorg Med Chem Lett 21: 841-5 (2011)
Article DOI: 10.1016/j.bmcl.2010.11.084
BindingDB Entry DOI: 10.7270/Q24J0FCP
G protein-coupled receptor 44
(Homo sapiens (Human))
BDBM50333494
((R)-2-(8-(4-fluoro-N-methylphenylsulfonamido)-6,7,...)
Show SMILES CN([C@@H]1CCc2c(CC(O)=O)c3cccnc3n2C1)S(=O)(=O)c1ccc(F)cc1 |r|
Show InChI InChI=1S/C20H20FN3O4S/c1-23(29(27,28)15-7-4-13(21)5-8-15)14-6-9-18-17(11-19(25)26)16-3-2-10-22-20(16)24(18)12-14/h2-5,7-8,10,14H,6,9,11-12H2,1H3,(H,25,26)/t14-/m1/s1
Reactome pathway
n/an/a 7n/an/an/an/an/an/a
Merck Frosst Centre for Therapeutic Research
Curated by ChEMBL
Assay Description
Antagonist activity at CRTH2 in human eosinophil assessed as effect of cellular shape change by EOS assay
Bioorg Med Chem Lett 21: 841-5 (2011)
Article DOI: 10.1016/j.bmcl.2010.11.084
BindingDB Entry DOI: 10.7270/Q24J0FCP
Cytochrome P450 2C9
(Homo sapiens (Human))
BDBM50333494
((R)-2-(8-(4-fluoro-N-methylphenylsulfonamido)-6,7,...)
Show SMILES CN([C@@H]1CCc2c(CC(O)=O)c3cccnc3n2C1)S(=O)(=O)c1ccc(F)cc1 |r|
Show InChI InChI=1S/C20H20FN3O4S/c1-23(29(27,28)15-7-4-13(21)5-8-15)14-6-9-18-17(11-19(25)26)16-3-2-10-22-20(16)24(18)12-14/h2-5,7-8,10,14H,6,9,11-12H2,1H3,(H,25,26)/t14-/m1/s1
Reactome pathway
n/an/a>5.00E+4n/an/an/an/an/an/a
Merck Frosst Centre for Therapeutic Research
Curated by ChEMBL
Assay Description
Inhibition of CYP2C9
Bioorg Med Chem Lett 21: 841-5 (2011)
Article DOI: 10.1016/j.bmcl.2010.11.084
BindingDB Entry DOI: 10.7270/Q24J0FCP
G protein-coupled receptor 44
(Homo sapiens (Human))
BDBM50333494
((R)-2-(8-(4-fluoro-N-methylphenylsulfonamido)-6,7,...)
Show SMILES CN([C@@H]1CCc2c(CC(O)=O)c3cccnc3n2C1)S(=O)(=O)c1ccc(F)cc1 |r|
Show InChI InChI=1S/C20H20FN3O4S/c1-23(29(27,28)15-7-4-13(21)5-8-15)14-6-9-18-17(11-19(25)26)16-3-2-10-22-20(16)24(18)12-14/h2-5,7-8,10,14H,6,9,11-12H2,1H3,(H,25,26)/t14-/m1/s1
Reactome pathway
n/an/a 3.40n/an/an/an/an/an/a
Merck Frosst Centre for Therapeutic Research
Curated by ChEMBL
Assay Description
Antagonist activity at human CRTH2 expressed in HEK293 cells assessed as inhibition of forskolin-induced increase intracellular [125I]cAMP level by s...
Bioorg Med Chem Lett 21: 841-5 (2011)
Article DOI: 10.1016/j.bmcl.2010.11.084
BindingDB Entry DOI: 10.7270/Q24J0FCP