BDBM50333604 1-(4-{2-[Benzyl(methyl)amino]ethoxy}phenyl)-4-(benzyloxy)pyridin-2(1H)-one::CHEMBL1642487
SMILES: CN(CCOc1ccc(cc1)-n1ccc(OCc2ccccc2)cc1=O)Cc1ccccc1
InChI Key: InChIKey=MGBCOVVRZAHNAM-UHFFFAOYSA-N
Data: 2 IC50
Activity Spreadsheet -- Enzyme Inhibition Constant Data from BindingDB
Found 2 hits for monomerid = 50333604
Trg + Lig
Ki
nM
ΔG°
kcal/mole
IC50
nM
Kd
nM
EC50/IC50
nM
koff
s-1
kon
M-1s-1
pHTemp
°C
Potassium voltage-gated channel subfamily H member 2
(Homo sapiens (Human))
BDBM50333604
(1-(4-{2-[Benzyl(methyl)amino]ethoxy}phenyl)-4-(ben...)
Show SMILES CN(CCOc1ccc(cc1)-n1ccc(OCc2ccccc2)cc1=O)Cc1ccccc1
Show InChI InChI=1S/C28H28N2O3/c1-29(21-23-8-4-2-5-9-23)18-19-32-26-14-12-25(13-15-26)30-17-16-27(20-28(30)31)33-22-24-10-6-3-7-11-24/h2-17,20H,18-19,21-22H2,1H3
Reactome pathway
n/an/a 0.810n/an/an/an/an/an/a
Tsukuba Research Institute
Curated by ChEMBL
Assay Description
Displacement of [35S]N-[(4R)-10-[(2R)-6-cyano-1,2,3,4-tetrahydro-2-naphthyl]-3,4-dihydro-4-hydroxyspiro[2H-1-benzopyran-2,40-piperidin]-6-yl]methanes...
Bioorg Med Chem 19: 883-93 (2011)
Article DOI: 10.1016/j.bmc.2010.12.002
BindingDB Entry DOI: 10.7270/Q2GT5NFT
Melanin-concentrating hormone receptor 1
(Homo sapiens (Human))
BDBM50333604
(1-(4-{2-[Benzyl(methyl)amino]ethoxy}phenyl)-4-(ben...)
Show SMILES CN(CCOc1ccc(cc1)-n1ccc(OCc2ccccc2)cc1=O)Cc1ccccc1
Show InChI InChI=1S/C28H28N2O3/c1-29(21-23-8-4-2-5-9-23)18-19-32-26-14-12-25(13-15-26)30-17-16-27(20-28(30)31)33-22-24-10-6-3-7-11-24/h2-17,20H,18-19,21-22H2,1H3
Reactome pathway
n/an/a 3.80n/an/an/an/an/an/a
Tsukuba Research Institute
Curated by ChEMBL
Assay Description
Displacement of [125I]MCH from human MCHR1 expressed in CHO cells by competition binding assay
Bioorg Med Chem 19: 883-93 (2011)
Article DOI: 10.1016/j.bmc.2010.12.002
BindingDB Entry DOI: 10.7270/Q2GT5NFT