null
SMILES: CCCCCN([C@@H]1CCc2c(CC(O)=O)c3ccccc3n2C1)S(=O)(=O)c1ccc(F)cc1
InChI Key: InChIKey=TWVFYVBKIHXAPO-LJQANCHMSA-N
Activity Spreadsheet -- Enzyme Inhibition Constant Data from BindingDB
Found 5 hits for monomerid = 50333848
Trg + Lig
Ki
nM
ΔG°
kcal/mole
IC50
nM
Kd
nM
EC50/IC50
nM
koff
s-1
kon
M-1s-1
pHTemp
°C
Prostaglandin D2 receptor 2
(Homo sapiens (Human))
BDBM50333848
((R)-2-(7-(4-fluoro-N-pentylphenylsulfonamido)-6,7,...)
Show SMILES CCCCCN([C@@H]1CCc2c(CC(O)=O)c3ccccc3n2C1)S(=O)(=O)c1ccc(F)cc1 |r|
Show InChI InChI=1S/C25H29FN2O4S/c1-2-3-6-15-28(33(31,32)20-12-9-18(26)10-13-20)19-11-14-24-22(16-25(29)30)21-7-4-5-8-23(21)27(24)17-19/h4-5,7-10,12-13,19H,2-3,6,11,14-17H2,1H3,(H,29,30)/t19-/m1/s1
Reactome pathway
1.60n/an/an/an/an/an/an/an/a
Merck Frosst Centre for Therapeutic Research
Curated by ChEMBL
Assay Description
Binding affinity to human recombinant CRTH2 receptor by cell based radioligand equilibrium competition assay
Bioorg Med Chem Lett 21: 288-93 (2010)
Article DOI: 10.1016/j.bmcl.2010.11.015
BindingDB Entry DOI: 10.7270/Q2959HTH
Thromboxane A2 receptor
(Homo sapiens (Human))
BDBM50333848
((R)-2-(7-(4-fluoro-N-pentylphenylsulfonamido)-6,7,...)
Show SMILES CCCCCN([C@@H]1CCc2c(CC(O)=O)c3ccccc3n2C1)S(=O)(=O)c1ccc(F)cc1 |r|
Show InChI InChI=1S/C25H29FN2O4S/c1-2-3-6-15-28(33(31,32)20-12-9-18(26)10-13-20)19-11-14-24-22(16-25(29)30)21-7-4-5-8-23(21)27(24)17-19/h4-5,7-10,12-13,19H,2-3,6,11,14-17H2,1H3,(H,29,30)/t19-/m1/s1
904n/an/an/an/an/an/an/an/a
Merck Frosst Centre for Therapeutic Research
Curated by ChEMBL
Assay Description
Binding affinity to thromboxane receptor
Bioorg Med Chem Lett 21: 288-93 (2010)
Article DOI: 10.1016/j.bmcl.2010.11.015
BindingDB Entry DOI: 10.7270/Q2959HTH
Prostaglandin D2 receptor
(Homo sapiens (Human))
BDBM50333848
((R)-2-(7-(4-fluoro-N-pentylphenylsulfonamido)-6,7,...)
Show SMILES CCCCCN([C@@H]1CCc2c(CC(O)=O)c3ccccc3n2C1)S(=O)(=O)c1ccc(F)cc1 |r|
Show InChI InChI=1S/C25H29FN2O4S/c1-2-3-6-15-28(33(31,32)20-12-9-18(26)10-13-20)19-11-14-24-22(16-25(29)30)21-7-4-5-8-23(21)27(24)17-19/h4-5,7-10,12-13,19H,2-3,6,11,14-17H2,1H3,(H,29,30)/t19-/m1/s1
1.21E+3n/an/an/an/an/an/an/an/a
Merck Frosst Centre for Therapeutic Research
Curated by ChEMBL
Assay Description
Binding affinity to prostanoid DP1 receptor
Bioorg Med Chem Lett 21: 288-93 (2010)
Article DOI: 10.1016/j.bmcl.2010.11.015
BindingDB Entry DOI: 10.7270/Q2959HTH
Prostaglandin D2 receptor 2
(Homo sapiens (Human))
BDBM50333848
((R)-2-(7-(4-fluoro-N-pentylphenylsulfonamido)-6,7,...)
Show SMILES CCCCCN([C@@H]1CCc2c(CC(O)=O)c3ccccc3n2C1)S(=O)(=O)c1ccc(F)cc1 |r|
Show InChI InChI=1S/C25H29FN2O4S/c1-2-3-6-15-28(33(31,32)20-12-9-18(26)10-13-20)19-11-14-24-22(16-25(29)30)21-7-4-5-8-23(21)27(24)17-19/h4-5,7-10,12-13,19H,2-3,6,11,14-17H2,1H3,(H,29,30)/t19-/m1/s1
Reactome pathway
n/an/a 107n/an/an/an/an/an/a
Merck Frosst Centre for Therapeutic Research
Curated by ChEMBL
Assay Description
Antagonist activity at CRTH2 receptor in human whole blood assessed as inhibition of DK-PGD2-induced eosinophils shape change
Bioorg Med Chem Lett 21: 288-93 (2010)
Article DOI: 10.1016/j.bmcl.2010.11.015
BindingDB Entry DOI: 10.7270/Q2959HTH
Prostaglandin D2 receptor 2
(Homo sapiens (Human))
BDBM50333848
((R)-2-(7-(4-fluoro-N-pentylphenylsulfonamido)-6,7,...)
Show SMILES CCCCCN([C@@H]1CCc2c(CC(O)=O)c3ccccc3n2C1)S(=O)(=O)c1ccc(F)cc1 |r|
Show InChI InChI=1S/C25H29FN2O4S/c1-2-3-6-15-28(33(31,32)20-12-9-18(26)10-13-20)19-11-14-24-22(16-25(29)30)21-7-4-5-8-23(21)27(24)17-19/h4-5,7-10,12-13,19H,2-3,6,11,14-17H2,1H3,(H,29,30)/t19-/m1/s1
Reactome pathway
n/an/a 4.90n/an/an/an/an/an/a
Merck Frosst Centre for Therapeutic Research
Curated by ChEMBL
Assay Description
Antagonist activity at human recombinant CRTH2 receptor expressed in HEK293 cells assessed as inhibition of DK-PGD2-induced intracellular cAMP format...
Bioorg Med Chem Lett 21: 288-93 (2010)
Article DOI: 10.1016/j.bmcl.2010.11.015
BindingDB Entry DOI: 10.7270/Q2959HTH