BDBM50333855 (R)-2-(7-(N,3-dimethylphenylsulfonamido)-6,7,8,9-tetrahydropyrido[1,2-a]indol-10-yl)acetic acid::CHEMBL1643794
SMILES: CN([C@@H]1CCc2c(CC(O)=O)c3ccccc3n2C1)S(=O)(=O)c1cccc(C)c1
InChI Key: InChIKey=KCJLSZJRHOVMDP-MRXNPFEDSA-N
Data: 3 KI  1 IC50
Activity Spreadsheet -- Enzyme Inhibition Constant Data from BindingDB
Found 4 hits for monomerid = 50333855
Trg + Lig
Ki
nM
ΔG°
kcal/mole
IC50
nM
Kd
nM
EC50/IC50
nM
koff
s-1
kon
M-1s-1
pHTemp
°C
G protein-coupled receptor 44
(Homo sapiens (Human))
BDBM50333855
((R)-2-(7-(N,3-dimethylphenylsulfonamido)-6,7,8,9-t...)
Show SMILES CN([C@@H]1CCc2c(CC(O)=O)c3ccccc3n2C1)S(=O)(=O)c1cccc(C)c1 |r|
Show InChI InChI=1S/C22H24N2O4S/c1-15-6-5-7-17(12-15)29(27,28)23(2)16-10-11-21-19(13-22(25)26)18-8-3-4-9-20(18)24(21)14-16/h3-9,12,16H,10-11,13-14H2,1-2H3,(H,25,26)/t16-/m1/s1
Reactome pathway
8.70n/an/an/an/an/an/an/an/a
Merck Frosst Centre for Therapeutic Research
Curated by ChEMBL
Assay Description
Binding affinity to human recombinant CRTH2 receptor by cell based radioligand equilibrium competition assay
Bioorg Med Chem Lett 21: 288-93 (2010)
Article DOI: 10.1016/j.bmcl.2010.11.015
BindingDB Entry DOI: 10.7270/Q2959HTH
Prostanoid DP receptor
(Homo sapiens (Human))
BDBM50333855
((R)-2-(7-(N,3-dimethylphenylsulfonamido)-6,7,8,9-t...)
Show SMILES CN([C@@H]1CCc2c(CC(O)=O)c3ccccc3n2C1)S(=O)(=O)c1cccc(C)c1 |r|
Show InChI InChI=1S/C22H24N2O4S/c1-15-6-5-7-17(12-15)29(27,28)23(2)16-10-11-21-19(13-22(25)26)18-8-3-4-9-20(18)24(21)14-16/h3-9,12,16H,10-11,13-14H2,1-2H3,(H,25,26)/t16-/m1/s1
250n/an/an/an/an/an/an/an/a
Merck Frosst Centre for Therapeutic Research
Curated by ChEMBL
Assay Description
Binding affinity to prostanoid DP1 receptor
Bioorg Med Chem Lett 21: 288-93 (2010)
Article DOI: 10.1016/j.bmcl.2010.11.015
BindingDB Entry DOI: 10.7270/Q2959HTH
Prostanoid TP receptor
(Homo sapiens (Human))
BDBM50333855
((R)-2-(7-(N,3-dimethylphenylsulfonamido)-6,7,8,9-t...)
Show SMILES CN([C@@H]1CCc2c(CC(O)=O)c3ccccc3n2C1)S(=O)(=O)c1cccc(C)c1 |r|
Show InChI InChI=1S/C22H24N2O4S/c1-15-6-5-7-17(12-15)29(27,28)23(2)16-10-11-21-19(13-22(25)26)18-8-3-4-9-20(18)24(21)14-16/h3-9,12,16H,10-11,13-14H2,1-2H3,(H,25,26)/t16-/m1/s1
>5.59E+3n/an/an/an/an/an/an/an/a
Merck Frosst Centre for Therapeutic Research
Curated by ChEMBL
Assay Description
Binding affinity to thromboxane receptor
Bioorg Med Chem Lett 21: 288-93 (2010)
Article DOI: 10.1016/j.bmcl.2010.11.015
BindingDB Entry DOI: 10.7270/Q2959HTH
G protein-coupled receptor 44
(Homo sapiens (Human))
BDBM50333855
((R)-2-(7-(N,3-dimethylphenylsulfonamido)-6,7,8,9-t...)
Show SMILES CN([C@@H]1CCc2c(CC(O)=O)c3ccccc3n2C1)S(=O)(=O)c1cccc(C)c1 |r|
Show InChI InChI=1S/C22H24N2O4S/c1-15-6-5-7-17(12-15)29(27,28)23(2)16-10-11-21-19(13-22(25)26)18-8-3-4-9-20(18)24(21)14-16/h3-9,12,16H,10-11,13-14H2,1-2H3,(H,25,26)/t16-/m1/s1
Reactome pathway
n/an/a 13n/an/an/an/an/an/a
Merck Frosst Centre for Therapeutic Research
Curated by ChEMBL
Assay Description
Antagonist activity at human recombinant CRTH2 receptor expressed in HEK293 cells assessed as inhibition of DK-PGD2-induced intracellular cAMP format...
Bioorg Med Chem Lett 21: 288-93 (2010)
Article DOI: 10.1016/j.bmcl.2010.11.015
BindingDB Entry DOI: 10.7270/Q2959HTH