BDBM50334014 4-(3-(1-benzyl-4-(3-(trifluoromethyl)phenyl)-1H-imidazol-2-yl)benzyl)morpholine::CHEMBL1644670
SMILES: FC(F)(F)c1cccc(c1)-c1cn(Cc2ccccc2)c(n1)-c1cccc(CN2CCOCC2)c1
InChI Key: InChIKey=HPQOEHRUCKPGIY-UHFFFAOYSA-N
Data: 2 EC50
Activity Spreadsheet -- Enzyme Inhibition Constant Data from BindingDB
Found 2 hits for monomerid = 50334014
Trg + Lig
Ki
nM
ΔG°
kcal/mole
IC50
nM
Kd
nM
EC50/IC50
nM
koff
s-1
kon
M-1s-1
pHTemp
°C
Cannabinoid receptor 2
(Homo sapiens (Human))
BDBM50334014
(4-(3-(1-benzyl-4-(3-(trifluoromethyl)phenyl)-1H-im...)
Show SMILES FC(F)(F)c1cccc(c1)-c1cn(Cc2ccccc2)c(n1)-c1cccc(CN2CCOCC2)c1
Show InChI InChI=1S/C28H26F3N3O/c29-28(30,31)25-11-5-9-23(17-25)26-20-34(19-21-6-2-1-3-7-21)27(32-26)24-10-4-8-22(16-24)18-33-12-14-35-15-13-33/h1-11,16-17,20H,12-15,18-19H2
Reactome pathway
n/an/an/an/a>1.00E+3n/an/an/an/a
Merck Research Laboratory
Curated by ChEMBL
Assay Description
Agonist activity at human cloned CB2 receptor expressed in CHO cells assessed as inhibition of forskolin-induced cAMP accumulation
Bioorg Med Chem Lett 21: 182-5 (2010)
Article DOI: 10.1016/j.bmcl.2010.11.044
BindingDB Entry DOI: 10.7270/Q20P108G
Cannabinoid receptor 1
(Homo sapiens (Human))
BDBM50334014
(4-(3-(1-benzyl-4-(3-(trifluoromethyl)phenyl)-1H-im...)
Show SMILES FC(F)(F)c1cccc(c1)-c1cn(Cc2ccccc2)c(n1)-c1cccc(CN2CCOCC2)c1
Show InChI InChI=1S/C28H26F3N3O/c29-28(30,31)25-11-5-9-23(17-25)26-20-34(19-21-6-2-1-3-7-21)27(32-26)24-10-4-8-22(16-24)18-33-12-14-35-15-13-33/h1-11,16-17,20H,12-15,18-19H2
NCI pathway
Reactome pathway
n/an/an/an/a>1.00E+3n/an/an/an/a
Merck Research Laboratory
Curated by ChEMBL
Assay Description
Agonist activity at human cloned CB1 receptor expressed in CHO cells assessed as inhibition of forskolin-induced cAMP accumulation
Bioorg Med Chem Lett 21: 182-5 (2010)
Article DOI: 10.1016/j.bmcl.2010.11.044
BindingDB Entry DOI: 10.7270/Q20P108G