BDBM50334025 4-(3-(4-(3-chlorophenyl)-1H-imidazol-2-yl)benzyl)-2-methylmorpholine::CHEMBL1644688
SMILES: CC1CN(Cc2cccc(c2)-c2nc(c[nH]2)-c2cccc(Cl)c2)CCO1
InChI Key: InChIKey=FAMCGMZOXGBNMJ-UHFFFAOYSA-N
Data: 2 EC50
Activity Spreadsheet -- Enzyme Inhibition Constant Data from BindingDB
Found 2 hits for monomerid = 50334025
Trg + Lig
Ki
nM
ΔG°
kcal/mole
IC50
nM
Kd
nM
EC50/IC50
nM
koff
s-1
kon
M-1s-1
pHTemp
°C
Cannabinoid receptor 2
(Homo sapiens (Human))
BDBM50334025
(4-(3-(4-(3-chlorophenyl)-1H-imidazol-2-yl)benzyl)-...)
Show SMILES CC1CN(Cc2cccc(c2)-c2nc(c[nH]2)-c2cccc(Cl)c2)CCO1
Show InChI InChI=1S/C21H22ClN3O/c1-15-13-25(8-9-26-15)14-16-4-2-6-18(10-16)21-23-12-20(24-21)17-5-3-7-19(22)11-17/h2-7,10-12,15H,8-9,13-14H2,1H3,(H,23,24)
Reactome pathway
n/an/an/an/a 14n/an/an/an/a
Merck Research Laboratory
Curated by ChEMBL
Assay Description
Agonist activity at human cloned CB2 receptor expressed in CHO cells assessed as inhibition of forskolin-induced cAMP accumulation
Bioorg Med Chem Lett 21: 182-5 (2010)
Article DOI: 10.1016/j.bmcl.2010.11.044
BindingDB Entry DOI: 10.7270/Q20P108G
Cannabinoid receptor 1
(Homo sapiens (Human))
BDBM50334025
(4-(3-(4-(3-chlorophenyl)-1H-imidazol-2-yl)benzyl)-...)
Show SMILES CC1CN(Cc2cccc(c2)-c2nc(c[nH]2)-c2cccc(Cl)c2)CCO1
Show InChI InChI=1S/C21H22ClN3O/c1-15-13-25(8-9-26-15)14-16-4-2-6-18(10-16)21-23-12-20(24-21)17-5-3-7-19(22)11-17/h2-7,10-12,15H,8-9,13-14H2,1H3,(H,23,24)
NCI pathway
Reactome pathway
n/an/an/an/a 3.25E+3n/an/an/an/a
Merck Research Laboratory
Curated by ChEMBL
Assay Description
Agonist activity at human cloned CB1 receptor expressed in CHO cells assessed as inhibition of forskolin-induced cAMP accumulation
Bioorg Med Chem Lett 21: 182-5 (2010)
Article DOI: 10.1016/j.bmcl.2010.11.044
BindingDB Entry DOI: 10.7270/Q20P108G