BDBM50334030 4,4-difluoro-1-(3-(4-(2-fluoro-4-methoxyphenyl)-1H-imidazol-2-yl)benzyl)piperidine::CHEMBL1644733
SMILES: COc1ccc(-c2c[nH]c(n2)-c2cccc(CN3CCC(F)(F)CC3)c2)c(F)c1
InChI Key: InChIKey=MKOCWWZXSVIVFC-UHFFFAOYSA-N
Data: 2 EC50
Activity Spreadsheet -- Enzyme Inhibition Constant Data from BindingDB
Found 2 hits for monomerid = 50334030
Trg + Lig
Ki
nM
ΔG°
kcal/mole
IC50
nM
Kd
nM
EC50/IC50
nM
koff
s-1
kon
M-1s-1
pHTemp
°C
Cannabinoid receptor 2
(Homo sapiens (Human))
BDBM50334030
(4,4-difluoro-1-(3-(4-(2-fluoro-4-methoxyphenyl)-1H...)
Show SMILES COc1ccc(-c2c[nH]c(n2)-c2cccc(CN3CCC(F)(F)CC3)c2)c(F)c1
Show InChI InChI=1S/C22H22F3N3O/c1-29-17-5-6-18(19(23)12-17)20-13-26-21(27-20)16-4-2-3-15(11-16)14-28-9-7-22(24,25)8-10-28/h2-6,11-13H,7-10,14H2,1H3,(H,26,27)
Reactome pathway
n/an/an/an/a 3n/an/an/an/a
Merck Research Laboratory
Curated by ChEMBL
Assay Description
Agonist activity at human cloned CB2 receptor expressed in CHO cells assessed as inhibition of forskolin-induced cAMP accumulation
Bioorg Med Chem Lett 21: 182-5 (2010)
Article DOI: 10.1016/j.bmcl.2010.11.044
BindingDB Entry DOI: 10.7270/Q20P108G
Cannabinoid receptor 1
(Homo sapiens (Human))
BDBM50334030
(4,4-difluoro-1-(3-(4-(2-fluoro-4-methoxyphenyl)-1H...)
Show SMILES COc1ccc(-c2c[nH]c(n2)-c2cccc(CN3CCC(F)(F)CC3)c2)c(F)c1
Show InChI InChI=1S/C22H22F3N3O/c1-29-17-5-6-18(19(23)12-17)20-13-26-21(27-20)16-4-2-3-15(11-16)14-28-9-7-22(24,25)8-10-28/h2-6,11-13H,7-10,14H2,1H3,(H,26,27)
NCI pathway
Reactome pathway
n/an/an/an/a 39n/an/an/an/a
Merck Research Laboratory
Curated by ChEMBL
Assay Description
Agonist activity at human cloned CB1 receptor expressed in CHO cells assessed as inhibition of forskolin-induced cAMP accumulation
Bioorg Med Chem Lett 21: 182-5 (2010)
Article DOI: 10.1016/j.bmcl.2010.11.044
BindingDB Entry DOI: 10.7270/Q20P108G