BDBM50334049 5-chloro-6-(1H-indol-7-yl)-2,2,4,8-tetramethyl-1,2-dihydroquinolin-3(4H)-one::CHEMBL1644754
SMILES: CC1C(=O)C(C)(C)Nc2c(C)cc(c(Cl)c12)-c1cccc2cc[nH]c12
InChI Key: InChIKey=PDCRQOSNBYFZJI-UHFFFAOYSA-N
Data: 2 KI  1 IC50  1 EC50
Activity Spreadsheet -- Enzyme Inhibition Constant Data from BindingDB
Found 4 hits for monomerid = 50334049
Trg + Lig
Ki
nM
ΔG°
kcal/mole
IC50
nM
Kd
nM
EC50/IC50
nM
koff
s-1
kon
M-1s-1
pHTemp
°C
Glucocorticoid receptor
(Homo sapiens (Human))
BDBM50334049
(5-chloro-6-(1H-indol-7-yl)-2,2,4,8-tetramethyl-1,2...)
Show SMILES CC1C(=O)C(C)(C)Nc2c(C)cc(c(Cl)c12)-c1cccc2cc[nH]c12
Show InChI InChI=1S/C21H21ClN2O/c1-11-10-15(14-7-5-6-13-8-9-23-19(13)14)17(22)16-12(2)20(25)21(3,4)24-18(11)16/h5-10,12,23-24H,1-4H3
5.80n/an/an/an/an/an/an/an/a
Ligand Pharmaceuticals
Curated by ChEMBL
Assay Description
Displacement of radiolabeled dexamethasone from glucocorticoid receptor expressed in baculovirus
Bioorg Med Chem Lett 21: 168-71 (2010)
Article DOI: 10.1016/j.bmcl.2010.11.047
BindingDB Entry DOI: 10.7270/Q2VX0GRB
Progesterone receptor
(Homo sapiens (Human))
BDBM50334049
(5-chloro-6-(1H-indol-7-yl)-2,2,4,8-tetramethyl-1,2...)
Show SMILES CC1C(=O)C(C)(C)Nc2c(C)cc(c(Cl)c12)-c1cccc2cc[nH]c12
Show InChI InChI=1S/C21H21ClN2O/c1-11-10-15(14-7-5-6-13-8-9-23-19(13)14)17(22)16-12(2)20(25)21(3,4)24-18(11)16/h5-10,12,23-24H,1-4H3
70n/an/an/an/an/an/an/an/a
Ligand Pharmaceuticals
Curated by ChEMBL
Assay Description
Binding affinity to progesterone receptor
Bioorg Med Chem Lett 21: 168-71 (2010)
Article DOI: 10.1016/j.bmcl.2010.11.047
BindingDB Entry DOI: 10.7270/Q2VX0GRB
Glucocorticoid receptor
(Homo sapiens (Human))
BDBM50334049
(5-chloro-6-(1H-indol-7-yl)-2,2,4,8-tetramethyl-1,2...)
Show SMILES CC1C(=O)C(C)(C)Nc2c(C)cc(c(Cl)c12)-c1cccc2cc[nH]c12
Show InChI InChI=1S/C21H21ClN2O/c1-11-10-15(14-7-5-6-13-8-9-23-19(13)14)17(22)16-12(2)20(25)21(3,4)24-18(11)16/h5-10,12,23-24H,1-4H3
n/an/a 13n/an/an/an/an/an/a
Ligand Pharmaceuticals
Curated by ChEMBL
Assay Description
Transrepression activity at glucocorticoid receptor in TNFalpha/IL1beta-stimulated human HepG2 cells assessed as inhibition of NFkappaB-dependent E-s...
Bioorg Med Chem Lett 21: 168-71 (2010)
Article DOI: 10.1016/j.bmcl.2010.11.047
BindingDB Entry DOI: 10.7270/Q2VX0GRB
Glucocorticoid receptor
(Homo sapiens (Human))
BDBM50334049
(5-chloro-6-(1H-indol-7-yl)-2,2,4,8-tetramethyl-1,2...)
Show SMILES CC1C(=O)C(C)(C)Nc2c(C)cc(c(Cl)c12)-c1cccc2cc[nH]c12
Show InChI InChI=1S/C21H21ClN2O/c1-11-10-15(14-7-5-6-13-8-9-23-19(13)14)17(22)16-12(2)20(25)21(3,4)24-18(11)16/h5-10,12,23-24H,1-4H3
n/an/an/an/a 235n/an/an/an/a
Ligand Pharmaceuticals
Curated by ChEMBL
Assay Description
Agonist activity at glucocorticoid receptor in human HepG2 cells co-transfected with GRE assessed as transactivation activity by luciferase reporter ...
Bioorg Med Chem Lett 21: 168-71 (2010)
Article DOI: 10.1016/j.bmcl.2010.11.047
BindingDB Entry DOI: 10.7270/Q2VX0GRB