BDBM50334080 2-[5-Chloro-2-(1-methyl-2-oxo-2,3,4,5-tetrahydro-1H-benzo[b]azepin-7-ylamino)-pyrimidin-4-ylamino]-benzamide::CHEMBL1644798
SMILES: CN1c2ccc(Nc3ncc(Cl)c(Nc4ccccc4C(N)=O)n3)cc2CCCC1=O
InChI Key: InChIKey=OLZPYOIWNSDNMX-UHFFFAOYSA-N
Data: 3 IC50
Activity Spreadsheet -- Enzyme Inhibition Constant Data from BindingDB
Found 3 hits for monomerid = 50334080
Trg + Lig
Ki
nM
ΔG°
kcal/mole
IC50
nM
Kd
nM
EC50/IC50
nM
koff
s-1
kon
M-1s-1
pHTemp
°C
Insulin receptor
(Homo sapiens (Human))
BDBM50334080
(2-[5-Chloro-2-(1-methyl-2-oxo-2,3,4,5-tetrahydro-1...)
Show SMILES CN1c2ccc(Nc3ncc(Cl)c(Nc4ccccc4C(N)=O)n3)cc2CCCC1=O
Show InChI InChI=1S/C22H21ClN6O2/c1-29-18-10-9-14(11-13(18)5-4-8-19(29)30)26-22-25-12-16(23)21(28-22)27-17-7-3-2-6-15(17)20(24)31/h2-3,6-7,9-12H,4-5,8H2,1H3,(H2,24,31)(H2,25,26,27,28)
n/an/a 4n/an/an/an/an/an/a
Cephalon, Inc
Curated by ChEMBL
Assay Description
Inhibition of IR kinase
Bioorg Med Chem Lett 21: 164-7 (2010)
Checked by Author
Article DOI: 10.1016/j.bmcl.2010.11.045
BindingDB Entry DOI: 10.7270/Q28W3F85
Hepatocyte growth factor receptor
(Homo sapiens (Human))
BDBM50334080
(2-[5-Chloro-2-(1-methyl-2-oxo-2,3,4,5-tetrahydro-1...)
Show SMILES CN1c2ccc(Nc3ncc(Cl)c(Nc4ccccc4C(N)=O)n3)cc2CCCC1=O
Show InChI InChI=1S/C22H21ClN6O2/c1-29-18-10-9-14(11-13(18)5-4-8-19(29)30)26-22-25-12-16(23)21(28-22)27-17-7-3-2-6-15(17)20(24)31/h2-3,6-7,9-12H,4-5,8H2,1H3,(H2,24,31)(H2,25,26,27,28)
n/an/a 85n/an/an/an/an/an/a
Cephalon, Inc
Curated by ChEMBL
Assay Description
Inhibition of human c-Met in human GTL16 cells by cell-based assay
Bioorg Med Chem Lett 21: 164-7 (2010)
Checked by Author
Article DOI: 10.1016/j.bmcl.2010.11.045
BindingDB Entry DOI: 10.7270/Q28W3F85
Hepatocyte growth factor receptor
(Homo sapiens (Human))
BDBM50334080
(2-[5-Chloro-2-(1-methyl-2-oxo-2,3,4,5-tetrahydro-1...)
Show SMILES CN1c2ccc(Nc3ncc(Cl)c(Nc4ccccc4C(N)=O)n3)cc2CCCC1=O
Show InChI InChI=1S/C22H21ClN6O2/c1-29-18-10-9-14(11-13(18)5-4-8-19(29)30)26-22-25-12-16(23)21(28-22)27-17-7-3-2-6-15(17)20(24)31/h2-3,6-7,9-12H,4-5,8H2,1H3,(H2,24,31)(H2,25,26,27,28)
n/an/a 7n/an/an/an/an/an/a
Cephalon, Inc
Curated by ChEMBL
Assay Description
Inhibition of c-Met
Bioorg Med Chem Lett 21: 164-7 (2010)
Checked by Author
Article DOI: 10.1016/j.bmcl.2010.11.045
BindingDB Entry DOI: 10.7270/Q28W3F85