BDBM50334212 (+/-)-threo-N-(o-Azido-benzyl)-4-iodomethylphenidate::CHEMBL1641694
SMILES: COC(=O)[C@@H]([C@H]1CCCCN1Cc1ccccc1N=[N+]=[N-])c1ccc(I)cc1
InChI Key: InChIKey=FAWDXIDAVOHYQT-WOJBJXKFSA-N
Data: 1 KI  1 IC50
Activity Spreadsheet -- Enzyme Inhibition Constant Data from BindingDB
Found 2 hits for monomerid = 50334212
Trg + Lig
Ki
nM
ΔG°
kcal/mole
IC50
nM
Kd
nM
EC50/IC50
nM
koff
s-1
kon
M-1s-1
pHTemp
°C
Sodium-dependent dopamine transporter
(Homo sapiens (Human))
BDBM50334212
((+/-)-threo-N-(o-Azido-benzyl)-4-iodomethylphenida...)
Show SMILES COC(=O)[C@@H]([C@H]1CCCCN1Cc1ccccc1N=[N+]=[N-])c1ccc(I)cc1 |r|
Show InChI InChI=1S/C21H23IN4O2/c1-28-21(27)20(15-9-11-17(22)12-10-15)19-8-4-5-13-26(19)14-16-6-2-3-7-18(16)24-25-23/h2-3,6-7,9-12,19-20H,4-5,8,13-14H2,1H3/t19-,20-/m1/s1
NCI pathway
Reactome pathway
517n/an/an/an/an/an/an/an/a
Duquesne University Mylan School of Pharmacy
Curated by ChEMBL
Assay Description
Displacement of [3H]WIN-35428 from human DAT stably expressed in mouse N2A cells by scintillation countnig
Bioorg Med Chem 19: 504-12 (2011)
Article DOI: 10.1016/j.bmc.2010.11.002
BindingDB Entry DOI: 10.7270/Q29Z9567
Sodium-dependent dopamine transporter
(Homo sapiens (Human))
BDBM50334212
((+/-)-threo-N-(o-Azido-benzyl)-4-iodomethylphenida...)
Show SMILES COC(=O)[C@@H]([C@H]1CCCCN1Cc1ccccc1N=[N+]=[N-])c1ccc(I)cc1 |r|
Show InChI InChI=1S/C21H23IN4O2/c1-28-21(27)20(15-9-11-17(22)12-10-15)19-8-4-5-13-26(19)14-16-6-2-3-7-18(16)24-25-23/h2-3,6-7,9-12,19-20H,4-5,8,13-14H2,1H3/t19-,20-/m1/s1
NCI pathway
Reactome pathway
n/an/a 1.23E+3n/an/an/an/an/an/a
Duquesne University Mylan School of Pharmacy
Curated by ChEMBL
Assay Description
Inhibition of [3H]dopamine uptake at human DAT expressed in mouse N2A cells
Bioorg Med Chem 19: 504-12 (2011)
Article DOI: 10.1016/j.bmc.2010.11.002
BindingDB Entry DOI: 10.7270/Q29Z9567