null
SMILES: OCc1ccc2nc(-c3ccc(Cl)cc3)n(C(C3CCCCC3)C(=O)NC3CCCCC3)c2c1
InChI Key: InChIKey=GJMAKYAIDVYTMY-UHFFFAOYSA-N
Activity Spreadsheet -- Enzyme Inhibition Constant Data from BindingDB
Found 1 hit for monomerid = 50334235
Trg + Lig
Ki
nM
ΔG°
kcal/mole
IC50
nM
Kd
nM
EC50/IC50
nM
koff
s-1
kon
M-1s-1
pHTemp
°C
Bile acid receptor
(Homo sapiens (Human))
BDBM50334235
(2-(2-(4-chlorophenyl)-6-(hydroxymethyl)-1H-benzo[d...)
Show SMILES OCc1ccc2nc(-c3ccc(Cl)cc3)n(C(C3CCCCC3)C(=O)NC3CCCCC3)c2c1
Show InChI InChI=1S/C28H34ClN3O2/c29-22-14-12-21(13-15-22)27-31-24-16-11-19(18-33)17-25(24)32(27)26(20-7-3-1-4-8-20)28(34)30-23-9-5-2-6-10-23/h11-17,20,23,26,33H,1-10,18H2,(H,30,34)
NCI pathway
Reactome pathway
n/an/a 6.19E+3n/an/an/an/an/an/a
F Hoffmann-La Roche AG
Curated by ChEMBL
Assay Description
Displacement of radioligand from human FXR by scintillation proximity assay
Bioorg Med Chem Lett 21: 191-4 (2010)
Article DOI: 10.1016/j.bmcl.2010.11.039
BindingDB Entry DOI: 10.7270/Q2XP757R