null
SMILES: Clc1ccc(cc1)-c1nc2ccccc2n1C(C1CCCCC1)C(=O)NC1CC1
InChI Key: InChIKey=DTISPNQDEGGOEE-UHFFFAOYSA-N
Activity Spreadsheet -- Enzyme Inhibition Constant Data from BindingDB
Found 1 hit for monomerid = 50334240
Trg + Lig
Ki
nM
ΔG°
kcal/mole
IC50
nM
Kd
nM
EC50/IC50
nM
koff
s-1
kon
M-1s-1
pHTemp
°C
Bile acid receptor
(Homo sapiens (Human))
BDBM50334240
(2-(2-(4-chlorophenyl)-1H-benzo[d]imidazol-1-yl)-2-...)
Show SMILES Clc1ccc(cc1)-c1nc2ccccc2n1C(C1CCCCC1)C(=O)NC1CC1
Show InChI InChI=1S/C24H26ClN3O/c25-18-12-10-17(11-13-18)23-27-20-8-4-5-9-21(20)28(23)22(16-6-2-1-3-7-16)24(29)26-19-14-15-19/h4-5,8-13,16,19,22H,1-3,6-7,14-15H2,(H,26,29)
NCI pathway
Reactome pathway
n/an/a 3.61E+3n/an/an/an/an/an/a
F Hoffmann-La Roche AG
Curated by ChEMBL
Assay Description
Displacement of radioligand from human FXR by scintillation proximity assay
Bioorg Med Chem Lett 21: 191-4 (2010)
Article DOI: 10.1016/j.bmcl.2010.11.039
BindingDB Entry DOI: 10.7270/Q2XP757R