BDBM50334254 5-Bromo-1-(3-chlorobenzenesulfonyl)-3-(4-methylpiperazin-1-yl)-1H-indole::CHEMBL1642418
SMILES: CN1CCN(CC1)c1cn(c2ccc(Br)cc12)S(=O)(=O)c1cccc(Cl)c1
InChI Key: InChIKey=KSZQAQVWGITECW-UHFFFAOYSA-N
Data: 1 KI  1 IC50
Activity Spreadsheet -- Enzyme Inhibition Constant Data from BindingDB
Found 2 hits for monomerid = 50334254
Trg + Lig
Ki
nM
ΔG°
kcal/mole
IC50
nM
Kd
nM
EC50/IC50
nM
koff
s-1
kon
M-1s-1
pHTemp
°C
5-hydroxytryptamine receptor 6
(Homo sapiens (Human))
BDBM50334254
(5-Bromo-1-(3-chlorobenzenesulfonyl)-3-(4-methylpip...)
Show SMILES CN1CCN(CC1)c1cn(c2ccc(Br)cc12)S(=O)(=O)c1cccc(Cl)c1
Show InChI InChI=1S/C19H19BrClN3O2S/c1-22-7-9-23(10-8-22)19-13-24(18-6-5-14(20)11-17(18)19)27(25,26)16-4-2-3-15(21)12-16/h2-6,11-13H,7-10H2,1H3
Reactome pathway
7.80n/an/an/an/an/an/an/an/a
Suven Life Sciences Ltd
Curated by ChEMBL
Assay Description
Displacement of [3H]LSD from human cloned 5HT6 receptor expressed in human HeLa cells by glass fiber filtration assay
Bioorg Med Chem Lett 21: 346-9 (2010)
Article DOI: 10.1016/j.bmcl.2010.11.001
BindingDB Entry DOI: 10.7270/Q2P84C5W
5-hydroxytryptamine receptor 6
(Homo sapiens (Human))
BDBM50334254
(5-Bromo-1-(3-chlorobenzenesulfonyl)-3-(4-methylpip...)
Show SMILES CN1CCN(CC1)c1cn(c2ccc(Br)cc12)S(=O)(=O)c1cccc(Cl)c1
Show InChI InChI=1S/C19H19BrClN3O2S/c1-22-7-9-23(10-8-22)19-13-24(18-6-5-14(20)11-17(18)19)27(25,26)16-4-2-3-15(21)12-16/h2-6,11-13H,7-10H2,1H3
Reactome pathway
n/an/a 322n/an/an/an/an/an/a
Suven Life Sciences Ltd
Curated by ChEMBL
Assay Description
Antagonist activity at human recombinant 5HT6 receptor expressed in CHO cells assessed as inhibition of 5-HT-stimulated cAMP accumulation by luminome...
Bioorg Med Chem Lett 21: 346-9 (2010)
Article DOI: 10.1016/j.bmcl.2010.11.001
BindingDB Entry DOI: 10.7270/Q2P84C5W