BDBM50334586 CHEMBL1641936::N3-(1-Adamantyl)-6-methyl-1-pentyl-4-oxo-1,4-dihydropyridine-3-carboxamide
SMILES: CCCCCn1cc(C(=O)NC23CC4CC(CC(C4)C2)C3)c(=O)cc1C
InChI Key: InChIKey=WCHVNGMNPCXFCG-UHFFFAOYSA-N
Data: 2 KI  1 EC50
Activity Spreadsheet -- Enzyme Inhibition Constant Data from BindingDB
Found 3 hits for monomerid = 50334586
Trg + Lig
Ki
nM
ΔG°
kcal/mole
IC50
nM
Kd
nM
EC50/IC50
nM
koff
s-1
kon
M-1s-1
pHTemp
°C
Cannabinoid receptor 2
(Homo sapiens (Human))
BDBM50334586
(CHEMBL1641936 | N3-(1-Adamantyl)-6-methyl-1-pentyl...)
Show SMILES CCCCCn1cc(C(=O)NC23CC4CC(CC(C4)C2)C3)c(=O)cc1C |TLB:14:15:13.12.18:19,THB:16:15:12:18.17.19,16:17:14.15.20:12,14:13:15.20.16:19|
Show InChI InChI=1S/C22H32N2O2/c1-3-4-5-6-24-14-19(20(25)7-15(24)2)21(26)23-22-11-16-8-17(12-22)10-18(9-16)13-22/h7,14,16-18H,3-6,8-13H2,1-2H3,(H,23,26)
Reactome pathway
20n/an/an/an/an/an/an/an/a
Universite£? Lille-Nord de France
Curated by ChEMBL
Assay Description
Displacement of [3H]-CP55940 from human CB2 receptor expressed in CHO cells after 1 hr
J Med Chem 53: 7918-31 (2010)
Article DOI: 10.1021/jm100286k
BindingDB Entry DOI: 10.7270/Q2BR8SFP
Cannabinoid receptor 1
(Homo sapiens (Human))
BDBM50334586
(CHEMBL1641936 | N3-(1-Adamantyl)-6-methyl-1-pentyl...)
Show SMILES CCCCCn1cc(C(=O)NC23CC4CC(CC(C4)C2)C3)c(=O)cc1C |TLB:14:15:13.12.18:19,THB:16:15:12:18.17.19,16:17:14.15.20:12,14:13:15.20.16:19|
Show InChI InChI=1S/C22H32N2O2/c1-3-4-5-6-24-14-19(20(25)7-15(24)2)21(26)23-22-11-16-8-17(12-22)10-18(9-16)13-22/h7,14,16-18H,3-6,8-13H2,1-2H3,(H,23,26)
NCI pathway
Reactome pathway
>3.00E+3n/an/an/an/an/an/an/an/a
Universite£? Lille-Nord de France
Curated by ChEMBL
Assay Description
Displacement of [3H]-SR141716A from human CB1 receptor expressed in CHO cells after 1 hr
J Med Chem 53: 7918-31 (2010)
Article DOI: 10.1021/jm100286k
BindingDB Entry DOI: 10.7270/Q2BR8SFP
Cannabinoid receptor 2
(Homo sapiens (Human))
BDBM50334586
(CHEMBL1641936 | N3-(1-Adamantyl)-6-methyl-1-pentyl...)
Show SMILES CCCCCn1cc(C(=O)NC23CC4CC(CC(C4)C2)C3)c(=O)cc1C |TLB:14:15:13.12.18:19,THB:16:15:12:18.17.19,16:17:14.15.20:12,14:13:15.20.16:19|
Show InChI InChI=1S/C22H32N2O2/c1-3-4-5-6-24-14-19(20(25)7-15(24)2)21(26)23-22-11-16-8-17(12-22)10-18(9-16)13-22/h7,14,16-18H,3-6,8-13H2,1-2H3,(H,23,26)
Reactome pathway
n/an/an/an/a 5.5n/an/an/an/a
Universite£? Lille-Nord de France
Curated by ChEMBL
Assay Description
Agonist activity at human CB2 receptor expressed in CHO cells assessed as stimulation of [35S]-GTPgammaS binding
J Med Chem 53: 7918-31 (2010)
Article DOI: 10.1021/jm100286k
BindingDB Entry DOI: 10.7270/Q2BR8SFP