BDBM50334751 3-(Naphthalen-1-ylsulfonyl)-N-(piperidin-4-yl)-1H-indazol-4-amine HCl::CHEMBL1642845
SMILES: O=S(=O)(c1n[nH]c2cccc(NC3CCNCC3)c12)c1cccc2ccccc12
InChI Key: InChIKey=VMHGLQPPHUEGJS-UHFFFAOYSA-N
Data: 1 KI  1 IC50
Activity Spreadsheet -- Enzyme Inhibition Constant Data from BindingDB
Found 2 hits for monomerid = 50334751
Trg + Lig
Ki
nM
ΔG°
kcal/mole
IC50
nM
Kd
nM
EC50/IC50
nM
koff
s-1
kon
M-1s-1
pHTemp
°C
5-hydroxytryptamine receptor 6
(Homo sapiens (Human))
BDBM50334751
(3-(Naphthalen-1-ylsulfonyl)-N-(piperidin-4-yl)-1H-...)
Show SMILES O=S(=O)(c1n[nH]c2cccc(NC3CCNCC3)c12)c1cccc2ccccc12
Show InChI InChI=1S/C22H22N4O2S/c27-29(28,20-10-3-6-15-5-1-2-7-17(15)20)22-21-18(8-4-9-19(21)25-26-22)24-16-11-13-23-14-12-16/h1-10,16,23-24H,11-14H2,(H,25,26)
Reactome pathway
2.80n/an/an/an/an/an/an/an/a
Wyeth Research
Curated by ChEMBL
Assay Description
Displacement of [3H]-LSD from cloned human 5-HT6 receptor expressed in human HeLa cells
Bioorg Med Chem 19: 650-62 (2011)
Article DOI: 10.1016/j.bmc.2010.10.033
BindingDB Entry DOI: 10.7270/Q29S1R9V
5-hydroxytryptamine receptor 6
(Homo sapiens (Human))
BDBM50334751
(3-(Naphthalen-1-ylsulfonyl)-N-(piperidin-4-yl)-1H-...)
Show SMILES O=S(=O)(c1n[nH]c2cccc(NC3CCNCC3)c12)c1cccc2ccccc12
Show InChI InChI=1S/C22H22N4O2S/c27-29(28,20-10-3-6-15-5-1-2-7-17(15)20)22-21-18(8-4-9-19(21)25-26-22)24-16-11-13-23-14-12-16/h1-10,16,23-24H,11-14H2,(H,25,26)
Reactome pathway
n/an/a 56n/an/an/an/an/an/a
Wyeth Research
Curated by ChEMBL
Assay Description
Antagonist activity at cloned human 5-HT6 receptor expressed in human HeLa cells assessed as inhibition of 5HT-induced cyclic AMP formation
Bioorg Med Chem 19: 650-62 (2011)
Article DOI: 10.1016/j.bmc.2010.10.033
BindingDB Entry DOI: 10.7270/Q29S1R9V