BDBM50334772 CHEMBL1642903::cis-((2R,4R)-4-(3,4-dichlorophenyl)-1,2,3,4-tetrahydronaphthalen-2-yl)methanamine
SMILES: NC[C@@H]1C[C@H](c2ccc(Cl)c(Cl)c2)c2ccccc2C1
InChI Key: InChIKey=AUOZLNRXVPELRP-XHDPSFHLSA-N
Data: 3 IC50
Activity Spreadsheet -- Enzyme Inhibition Constant Data from BindingDB
Found 3 hits for monomerid = 50334772
Trg + Lig
Ki
nM
ΔG°
kcal/mole
IC50
nM
Kd
nM
EC50/IC50
nM
koff
s-1
kon
M-1s-1
pHTemp
°C
Sodium-dependent serotonin transporter
(Homo sapiens (Human))
BDBM50334772
(CHEMBL1642903 | cis-((2R,4R)-4-(3,4-dichlorophenyl...)
Show SMILES NC[C@@H]1C[C@H](c2ccc(Cl)c(Cl)c2)c2ccccc2C1 |r|
Show InChI InChI=1S/C17H17Cl2N/c18-16-6-5-13(9-17(16)19)15-8-11(10-20)7-12-3-1-2-4-14(12)15/h1-6,9,11,15H,7-8,10,20H2/t11-,15+/m0/s1
n/an/a 19n/an/an/an/an/an/a
Sepracor Inc.
Curated by ChEMBL
Assay Description
Inhibition of [3H]serotonin reuptake at human SERT expressed in HEK293 cells by scintillation counting
Bioorg Med Chem 19: 663-76 (2011)
Article DOI: 10.1016/j.bmc.2010.10.034
BindingDB Entry DOI: 10.7270/Q2639Q0M
Sodium-dependent dopamine transporter
(Homo sapiens (Human))
BDBM50334772
(CHEMBL1642903 | cis-((2R,4R)-4-(3,4-dichlorophenyl...)
Show SMILES NC[C@@H]1C[C@H](c2ccc(Cl)c(Cl)c2)c2ccccc2C1 |r|
Show InChI InChI=1S/C17H17Cl2N/c18-16-6-5-13(9-17(16)19)15-8-11(10-20)7-12-3-1-2-4-14(12)15/h1-6,9,11,15H,7-8,10,20H2/t11-,15+/m0/s1
NCI pathway
Reactome pathway
n/an/a 111n/an/an/an/an/an/a
Sepracor Inc.
Curated by ChEMBL
Assay Description
Inhibition of [3H]dopamine reuptake at human DAT expressed in CHOK1 cells by scintillation counting
Bioorg Med Chem 19: 663-76 (2011)
Article DOI: 10.1016/j.bmc.2010.10.034
BindingDB Entry DOI: 10.7270/Q2639Q0M
Sodium-dependent noradrenaline transporter
(Homo sapiens (Human))
BDBM50334772
(CHEMBL1642903 | cis-((2R,4R)-4-(3,4-dichlorophenyl...)
Show SMILES NC[C@@H]1C[C@H](c2ccc(Cl)c(Cl)c2)c2ccccc2C1 |r|
Show InChI InChI=1S/C17H17Cl2N/c18-16-6-5-13(9-17(16)19)15-8-11(10-20)7-12-3-1-2-4-14(12)15/h1-6,9,11,15H,7-8,10,20H2/t11-,15+/m0/s1
Reactome pathway
n/an/a 257n/an/an/an/an/an/a
Sepracor Inc.
Curated by ChEMBL
Assay Description
Inhibition of [3H]norepinephrine reuptake at human NET expressed in MDCK cells by scintillation counting
Bioorg Med Chem 19: 663-76 (2011)
Article DOI: 10.1016/j.bmc.2010.10.034
BindingDB Entry DOI: 10.7270/Q2639Q0M