BDBM50335146 4-Chloro-3-(4-hydroxybenzyl)-1-(beta-D-xylopyranosyl)-1H-indole::CHEMBL1650502
SMILES: O[C@@H]1CO[C@H]([C@H](O)[C@H]1O)n1cc(Cc2ccc(O)cc2)c2c(Cl)cccc12
InChI Key: InChIKey=GDOCXHVTFBTYJC-GSEOLPGOSA-N
Data: 2 EC50
Activity Spreadsheet -- Enzyme Inhibition Constant Data from BindingDB
Found 2 hits for monomerid = 50335146
Trg + Lig
Ki
nM
ΔG°
kcal/mole
IC50
nM
Kd
nM
EC50/IC50
nM
koff
s-1
kon
M-1s-1
pHTemp
°C
Sodium/glucose cotransporter 1 (SGLT1)
(Homo sapiens (Human))
BDBM50335146
(4-Chloro-3-(4-hydroxybenzyl)-1-(beta-D-xylopyranos...)
Show SMILES O[C@@H]1CO[C@H]([C@H](O)[C@H]1O)n1cc(Cc2ccc(O)cc2)c2c(Cl)cccc12 |r|
Show InChI InChI=1S/C20H20ClNO5/c21-14-2-1-3-15-17(14)12(8-11-4-6-13(23)7-5-11)9-22(15)20-19(26)18(25)16(24)10-27-20/h1-7,9,16,18-20,23-26H,8,10H2/t16-,18+,19-,20-/m1/s1
n/an/an/an/a 234n/an/an/an/a
Taiwan National Health Research Institutes
Curated by ChEMBL
Assay Description
Inhibition of human SGLT1 expressed in CHO cells assessed as sodium-dependent [14C]-alpha-methyl-D-glucopyranoside uptake after 2 hrs by liquid scint...
J Med Chem 54: 166-78 (2011)
Article DOI: 10.1021/jm101072y
BindingDB Entry DOI: 10.7270/Q2445NG8
Sodium/glucose cotransporter 2
(Homo sapiens (Human))
BDBM50335146
(4-Chloro-3-(4-hydroxybenzyl)-1-(beta-D-xylopyranos...)
Show SMILES O[C@@H]1CO[C@H]([C@H](O)[C@H]1O)n1cc(Cc2ccc(O)cc2)c2c(Cl)cccc12 |r|
Show InChI InChI=1S/C20H20ClNO5/c21-14-2-1-3-15-17(14)12(8-11-4-6-13(23)7-5-11)9-22(15)20-19(26)18(25)16(24)10-27-20/h1-7,9,16,18-20,23-26H,8,10H2/t16-,18+,19-,20-/m1/s1
n/an/an/an/a 255n/an/an/an/a
Taiwan National Health Research Institutes
Curated by ChEMBL
Assay Description
Inhibition of human SGLT2 expressed in CHO cells assessed as sodium-dependent [14C]-alpha-methyl-D-glucopyranoside uptake after 2 hrs by liquid scint...
J Med Chem 54: 166-78 (2011)
Article DOI: 10.1021/jm101072y
BindingDB Entry DOI: 10.7270/Q2445NG8