BDBM50335186 CHEMBL1650543::N-[3-[(3(S)-Fluoro-1-pyrrolidinyl)methyl]-5-isothiazolyl]-6-methyl-3-(1H-pyrazol-4-yl)imidazo[1,2-a]pyrazin-8-amine Hydrochloride
SMILES: Cc1cn2c(cnc2c(Nc2cc(CN3CC[C@H](F)C3)ns2)n1)-c1cn[nH]c1
InChI Key: InChIKey=QZCMKSLZWAYEFU-ZDUSSCGKSA-N
Data: 1 IC50
Activity Spreadsheet -- Enzyme Inhibition Constant Data from BindingDB
Found 1 hit for monomerid = 50335186
Trg + Lig
Ki
nM
ΔG°
kcal/mole
IC50
nM
Kd
nM
EC50/IC50
nM
koff
s-1
kon
M-1s-1
pHTemp
°C
Aurora kinase B
(Homo sapiens (Human))
BDBM50335186
(CHEMBL1650543 | N-[3-[(3(S)-Fluoro-1-pyrrolidinyl)...)
Show SMILES Cc1cn2c(cnc2c(Nc2cc(CN3CC[C@H](F)C3)ns2)n1)-c1cn[nH]c1 |r|
Show InChI InChI=1S/C18H19FN8S/c1-11-8-27-15(12-5-21-22-6-12)7-20-18(27)17(23-11)24-16-4-14(25-28-16)10-26-3-2-13(19)9-26/h4-8,13H,2-3,9-10H2,1H3,(H,21,22)(H,23,24)/t13-/m0/s1
Reactome pathway
n/an/a 93n/an/an/an/an/an/a
Merck Research Laboratories
Curated by ChEMBL
Assay Description
Inhibition of Aurora B in human HCT116 cells assessed as inhibition of histone H3 phosphorylation by immunofluorescence assay
J Med Chem 54: 201-10 (2011)
Article DOI: 10.1021/jm1010995
BindingDB Entry DOI: 10.7270/Q2VM4D76