BDBM50335193 6-Methyl-N-[3-[[(2,2,3,3,3-pentafluoropropyl)amino]methyl]-5-isothiazolyl]-3-(1H-pyrazol-4-yl)imidazo[1,2-a]pyrazin-8-amineHydrochloride::CHEMBL1650550
SMILES: Cc1cn2c(cnc2c(Nc2cc(CNCC(F)(F)C(F)(F)F)ns2)n1)-c1cn[nH]c1
InChI Key: InChIKey=JQTJXXKLVJKNLC-UHFFFAOYSA-N
Data: 1 IC50
Activity Spreadsheet -- Enzyme Inhibition Constant Data from BindingDB
Found 1 hit for monomerid = 50335193
Trg + Lig
Ki
nM
ΔG°
kcal/mole
IC50
nM
Kd
nM
EC50/IC50
nM
koff
s-1
kon
M-1s-1
pHTemp
°C
Aurora kinase B
(Homo sapiens (Human))
BDBM50335193
(6-Methyl-N-[3-[[(2,2,3,3,3-pentafluoropropyl)amino...)
Show SMILES Cc1cn2c(cnc2c(Nc2cc(CNCC(F)(F)C(F)(F)F)ns2)n1)-c1cn[nH]c1
Show InChI InChI=1S/C17H15F5N8S/c1-9-7-30-12(10-3-25-26-4-10)6-24-15(30)14(27-9)28-13-2-11(29-31-13)5-23-8-16(18,19)17(20,21)22/h2-4,6-7,23H,5,8H2,1H3,(H,25,26)(H,27,28)
Reactome pathway
n/an/a 51n/an/an/an/an/an/a
Merck Research Laboratories
Curated by ChEMBL
Assay Description
Inhibition of Aurora B in human HCT116 cells assessed as inhibition of histone H3 phosphorylation by immunofluorescence assay
J Med Chem 54: 201-10 (2011)
Article DOI: 10.1021/jm1010995
BindingDB Entry DOI: 10.7270/Q2VM4D76