BDBM50335215 (S)-5-chloro-N2-(1-(5-fluoropyrimidin-2-yl)ethyl)-N4-(5-methyl-1H-pyrazol-3-yl)-6-morpholinopyrimidine-2,4-diamine::CHEMBL1650734
SMILES: C[C@H](Nc1nc(Nc2cc(C)n[nH]2)c(Cl)c(n1)N1CCOCC1)c1ncc(F)cn1
InChI Key: InChIKey=WTMZMIXYYDZHKB-NSHDSACASA-N
Data: 2 IC50
Activity Spreadsheet -- Enzyme Inhibition Constant Data from BindingDB
Found 2 hits for monomerid = 50335215
Trg + Lig
Ki
nM
ΔG°
kcal/mole
IC50
nM
Kd
nM
EC50/IC50
nM
koff
s-1
kon
M-1s-1
pHTemp
°C
Tyrosine-protein kinase JAK3
(Homo sapiens (Human))
BDBM50335215
((S)-5-chloro-N2-(1-(5-fluoropyrimidin-2-yl)ethyl)-...)
Show SMILES C[C@H](Nc1nc(Nc2cc(C)n[nH]2)c(Cl)c(n1)N1CCOCC1)c1ncc(F)cn1 |r|
Show InChI InChI=1S/C18H21ClFN9O/c1-10-7-13(28-27-10)24-16-14(19)17(29-3-5-30-6-4-29)26-18(25-16)23-11(2)15-21-8-12(20)9-22-15/h7-9,11H,3-6H2,1-2H3,(H3,23,24,25,26,27,28)/t11-/m0/s1
Reactome pathway
n/an/a 1.18E+4n/an/an/an/an/an/a
AstraZeneca R&D
Curated by ChEMBL
Assay Description
Inhibition of JAK3 using 5 mM of ATP
J Med Chem 54: 262-76 (2011)
Article DOI: 10.1021/jm1011319
BindingDB Entry DOI: 10.7270/Q2M32WRM
Tyrosine-protein kinase JAK2
(Homo sapiens (Human))
BDBM50335215
((S)-5-chloro-N2-(1-(5-fluoropyrimidin-2-yl)ethyl)-...)
Show SMILES C[C@H](Nc1nc(Nc2cc(C)n[nH]2)c(Cl)c(n1)N1CCOCC1)c1ncc(F)cn1 |r|
Show InChI InChI=1S/C18H21ClFN9O/c1-10-7-13(28-27-10)24-16-14(19)17(29-3-5-30-6-4-29)26-18(25-16)23-11(2)15-21-8-12(20)9-22-15/h7-9,11H,3-6H2,1-2H3,(H3,23,24,25,26,27,28)/t11-/m0/s1
Reactome pathway
n/an/a 9n/an/an/an/an/an/a
AstraZeneca R&D
Curated by ChEMBL
Assay Description
Inhibition of JAK2 using 5 mM of ATP
J Med Chem 54: 262-76 (2011)
Article DOI: 10.1021/jm1011319
BindingDB Entry DOI: 10.7270/Q2M32WRM