BDBM50335329 2-(4-Fluorobenzyl)-4-(5-methyl-1H-pyrazol-3-ylamino)-2Hphthalazin-1-one::CHEMBL1651476
SMILES: Cc1cc(Nc2nn(Cc3ccc(F)cc3)c(=O)c3ccccc23)[nH]n1
InChI Key: InChIKey=AQQWXMKDEBTQIT-UHFFFAOYSA-N
Data: 2 IC50
Activity Spreadsheet -- Enzyme Inhibition Constant Data from BindingDB
Found 2 hits for monomerid = 50335329
Trg + Lig
Ki
nM
ΔG°
kcal/mole
IC50
nM
Kd
nM
EC50/IC50
nM
koff
s-1
kon
M-1s-1
pHTemp
°C
Aurora kinase A
(Homo sapiens (Human))
BDBM50335329
(2-(4-Fluorobenzyl)-4-(5-methyl-1H-pyrazol-3-ylamin...)
Show SMILES Cc1cc(Nc2nn(Cc3ccc(F)cc3)c(=O)c3ccccc23)[nH]n1
Show InChI InChI=1S/C19H16FN5O/c1-12-10-17(23-22-12)21-18-15-4-2-3-5-16(15)19(26)25(24-18)11-13-6-8-14(20)9-7-13/h2-10H,11H2,1H3,(H2,21,22,23,24)
NCI pathway
Reactome pathway
n/an/a 14n/an/an/an/an/an/a
Evotec (UK) Ltd.
Curated by ChEMBL
Assay Description
Inhibition of Aurora A by ELISA
J Med Chem 54: 312-9 (2011)
Article DOI: 10.1021/jm101346r
BindingDB Entry DOI: 10.7270/Q29P32MB
Aurora kinase B
(Homo sapiens (Human))
BDBM50335329
(2-(4-Fluorobenzyl)-4-(5-methyl-1H-pyrazol-3-ylamin...)
Show SMILES Cc1cc(Nc2nn(Cc3ccc(F)cc3)c(=O)c3ccccc23)[nH]n1
Show InChI InChI=1S/C19H16FN5O/c1-12-10-17(23-22-12)21-18-15-4-2-3-5-16(15)19(26)25(24-18)11-13-6-8-14(20)9-7-13/h2-10H,11H2,1H3,(H2,21,22,23,24)
Reactome pathway
n/an/a 6.90E+4n/an/an/an/an/an/a
Evotec (UK) Ltd.
Curated by ChEMBL
Assay Description
Inhibition of Aurora B by ELISA
J Med Chem 54: 312-9 (2011)
Article DOI: 10.1021/jm101346r
BindingDB Entry DOI: 10.7270/Q29P32MB