BDBM50335330 4-(5-Methyl-2H-pyrazole-3-ylamino)phenyl-2H-phthalazin-1-one::4-[(5-methyl-1H-pyrazol-3-yl)amino]-2-phenylphthalazin-1(2H)-one::CHEMBL1615165
SMILES: Cc1cc(Nc2nn(-c3ccccc3)c(=O)c3ccccc23)[nH]n1
InChI Key: InChIKey=DSDIWWSXOOXFSI-UHFFFAOYSA-N
Data: 2 IC50
Activity Spreadsheet -- Enzyme Inhibition Constant Data from BindingDB
Found 2 hits for monomerid = 50335330
Trg + Lig
Ki
nM
ΔG°
kcal/mole
IC50
nM
Kd
nM
EC50/IC50
nM
koff
s-1
kon
M-1s-1
pHTemp
°C
Aurora kinase A
(Homo sapiens (Human))
BDBM50335330
(4-(5-Methyl-2H-pyrazole-3-ylamino)phenyl-2H-phthal...)
Show SMILES Cc1cc(Nc2nn(-c3ccccc3)c(=O)c3ccccc23)[nH]n1
Show InChI InChI=1S/C18H15N5O/c1-12-11-16(21-20-12)19-17-14-9-5-6-10-15(14)18(24)23(22-17)13-7-3-2-4-8-13/h2-11H,1H3,(H2,19,20,21,22)
NCI pathway
Reactome pathway
n/an/a 31n/an/an/an/an/an/a
Evotec (UK) Ltd.
Curated by ChEMBL
Assay Description
Inhibition of Aurora A by ELISA
J Med Chem 54: 312-9 (2011)
Article DOI: 10.1021/jm101346r
BindingDB Entry DOI: 10.7270/Q29P32MB
Aurora kinase B
(Homo sapiens (Human))
BDBM50335330
(4-(5-Methyl-2H-pyrazole-3-ylamino)phenyl-2H-phthal...)
Show SMILES Cc1cc(Nc2nn(-c3ccccc3)c(=O)c3ccccc23)[nH]n1
Show InChI InChI=1S/C18H15N5O/c1-12-11-16(21-20-12)19-17-14-9-5-6-10-15(14)18(24)23(22-17)13-7-3-2-4-8-13/h2-11H,1H3,(H2,19,20,21,22)
Reactome pathway
n/an/a>1.00E+5n/an/an/an/an/an/a
Evotec (UK) Ltd.
Curated by ChEMBL
Assay Description
Inhibition of Aurora B by ELISA
J Med Chem 54: 312-9 (2011)
Article DOI: 10.1021/jm101346r
BindingDB Entry DOI: 10.7270/Q29P32MB