BDBM50335386 CHEMBL1651634::N-Butoxypentyl-L-ido-1-deoxynojirimycin
SMILES: CCCCOCCCCCN1C[C@H](O)[C@@H](O)[C@H](O)[C@@H]1CO
InChI Key: InChIKey=YMYODBBUEFCWGO-BYNSBNAKSA-N
Data: 6 IC50
Activity Spreadsheet -- Enzyme Inhibition Constant Data from BindingDB
Found 6 hits for monomerid = 50335386
Trg + Lig
Ki
nM
ΔG°
kcal/mole
IC50
nM
Kd
nM
EC50/IC50
nM
koff
s-1
kon
M-1s-1
pHTemp
°C
Ceramide glucosyltransferase
(Mus musculus)
BDBM50335386
(CHEMBL1651634 | N-Butoxypentyl-L-ido-1-deoxynojiri...)
Show SMILES CCCCOCCCCCN1C[C@H](O)[C@@H](O)[C@H](O)[C@@H]1CO |r|
Show InChI InChI=1S/C15H31NO5/c1-2-3-8-21-9-6-4-5-7-16-10-13(18)15(20)14(19)12(16)11-17/h12-15,17-20H,2-11H2,1H3/t12-,13-,14+,15+/m0/s1
Reactome pathway
n/an/a 2.00E+3n/an/an/an/an/an/a
TBA
Curated by ChEMBL
Assay Description
Inhibition of glucosylceramide synthase in mouse RAW cells preincubated with compound for 15 mins by in-situ enzyme inhibition assay
ACS Med Chem Lett 2: 119-123 (2011)
Article DOI: 10.1021/ml100192b
BindingDB Entry DOI: 10.7270/Q21C1X5H
Lysosomal acid glucosylceramidase
(Homo sapiens (Human))
BDBM50335386
(CHEMBL1651634 | N-Butoxypentyl-L-ido-1-deoxynojiri...)
Show SMILES CCCCOCCCCCN1C[C@H](O)[C@@H](O)[C@H](O)[C@@H]1CO |r|
Show InChI InChI=1S/C15H31NO5/c1-2-3-8-21-9-6-4-5-7-16-10-13(18)15(20)14(19)12(16)11-17/h12-15,17-20H,2-11H2,1H3/t12-,13-,14+,15+/m0/s1
Reactome pathway
n/an/a>1.00E+6n/an/an/an/an/an/a
TBA
Curated by ChEMBL
Assay Description
Inhibition of recombinant GBA1 preincuabated with compound for 30 mins using 4-methylumbelliferyl-B-glucoside substrate by fluorimetric assay
ACS Med Chem Lett 2: 119-123 (2011)
Article DOI: 10.1021/ml100192b
BindingDB Entry DOI: 10.7270/Q21C1X5H
Beta-glucosidase
(Homo sapiens (Human))
BDBM50335386
(CHEMBL1651634 | N-Butoxypentyl-L-ido-1-deoxynojiri...)
Show SMILES CCCCOCCCCCN1C[C@H](O)[C@@H](O)[C@H](O)[C@@H]1CO |r|
Show InChI InChI=1S/C15H31NO5/c1-2-3-8-21-9-6-4-5-7-16-10-13(18)15(20)14(19)12(16)11-17/h12-15,17-20H,2-11H2,1H3/t12-,13-,14+,15+/m0/s1
Reactome pathway
n/an/a 90n/an/an/an/an/an/a
TBA
Curated by ChEMBL
Assay Description
Inhibition of recombinant GBA2 preincuabated with compound for 30 mins using 4-methylumbelliferyl-B-glucoside substrate by fluorimetric assay
ACS Med Chem Lett 2: 119-123 (2011)
Article DOI: 10.1021/ml100192b
BindingDB Entry DOI: 10.7270/Q21C1X5H
Beta-galactosidase
(Mus musculus)
BDBM50335386
(CHEMBL1651634 | N-Butoxypentyl-L-ido-1-deoxynojiri...)
Show SMILES CCCCOCCCCCN1C[C@H](O)[C@@H](O)[C@H](O)[C@@H]1CO |r|
Show InChI InChI=1S/C15H31NO5/c1-2-3-8-21-9-6-4-5-7-16-10-13(18)15(20)14(19)12(16)11-17/h12-15,17-20H,2-11H2,1H3/t12-,13-,14+,15+/m0/s1
Reactome pathway
n/an/a 4.00E+5n/an/an/an/an/an/a
TBA
Curated by ChEMBL
Assay Description
Inhibition of lactase in mouse intestinal input by glucose release assay
ACS Med Chem Lett 2: 119-123 (2011)
Article DOI: 10.1021/ml100192b
BindingDB Entry DOI: 10.7270/Q21C1X5H
Sucrase-isomaltase
(Mus musculus)
BDBM50335386
(CHEMBL1651634 | N-Butoxypentyl-L-ido-1-deoxynojiri...)
Show SMILES CCCCOCCCCCN1C[C@H](O)[C@@H](O)[C@H](O)[C@@H]1CO |r|
Show InChI InChI=1S/C15H31NO5/c1-2-3-8-21-9-6-4-5-7-16-10-13(18)15(20)14(19)12(16)11-17/h12-15,17-20H,2-11H2,1H3/t12-,13-,14+,15+/m0/s1
n/an/a>1.00E+6n/an/an/an/an/an/a
TBA
Curated by ChEMBL
Assay Description
Inhibition of sucrase in mouse intestinal input by glucose release assay
ACS Med Chem Lett 2: 119-123 (2011)
Article DOI: 10.1021/ml100192b
BindingDB Entry DOI: 10.7270/Q21C1X5H
alpha-glucosidase (Gaa)
(Mus musculus (Mouse))
BDBM50335386
(CHEMBL1651634 | N-Butoxypentyl-L-ido-1-deoxynojiri...)
Show SMILES CCCCOCCCCCN1C[C@H](O)[C@@H](O)[C@H](O)[C@@H]1CO |r|
Show InChI InChI=1S/C15H31NO5/c1-2-3-8-21-9-6-4-5-7-16-10-13(18)15(20)14(19)12(16)11-17/h12-15,17-20H,2-11H2,1H3/t12-,13-,14+,15+/m0/s1
n/an/a>1.00E+6n/an/an/an/an/an/a
TBA
Curated by ChEMBL
Assay Description
Inhibition of maltase in mouse intestinal input by glucose release assay
ACS Med Chem Lett 2: 119-123 (2011)
Article DOI: 10.1021/ml100192b
BindingDB Entry DOI: 10.7270/Q21C1X5H