BDBM50335390 CHEMBL1651630::N-Hexoxypentyl-1-deoxynojirimycin
SMILES: CCCCCCOCCCCCN1C[C@H](O)[C@@H](O)[C@H](O)[C@H]1CO
InChI Key: InChIKey=RCXJPSZNTHETPE-YYIAUSFCSA-N
Data: 8 IC50
Activity Spreadsheet -- Enzyme Inhibition Constant Data from BindingDB
Found 8 hits for monomerid = 50335390
Trg + Lig
Ki
nM
ΔG°
kcal/mole
IC50
nM
Kd
nM
EC50/IC50
nM
koff
s-1
kon
M-1s-1
pHTemp
°C
Lysosomal acid glucosylceramidase
(Homo sapiens (Human))
BDBM50335390
(CHEMBL1651630 | N-Hexoxypentyl-1-deoxynojirimycin)
Show SMILES CCCCCCOCCCCCN1C[C@H](O)[C@@H](O)[C@H](O)[C@H]1CO |r|
Show InChI InChI=1S/C17H35NO5/c1-2-3-4-7-10-23-11-8-5-6-9-18-12-15(20)17(22)16(21)14(18)13-19/h14-17,19-22H,2-13H2,1H3/t14-,15+,16-,17-/m1/s1
Reactome pathway
n/an/a 2.05E+5n/an/an/an/an/an/a
TBA
Curated by ChEMBL
Assay Description
Inhibition of recombinant GBA1 preincuabated with compound for 30 mins using 4-methylumbelliferyl-B-glucoside substrate by fluorimetric assay
ACS Med Chem Lett 2: 119-123 (2011)
Article DOI: 10.1021/ml100192b
BindingDB Entry DOI: 10.7270/Q21C1X5H
Ceramide glucosyltransferase
(Mus musculus)
BDBM50335390
(CHEMBL1651630 | N-Hexoxypentyl-1-deoxynojirimycin)
Show SMILES CCCCCCOCCCCCN1C[C@H](O)[C@@H](O)[C@H](O)[C@H]1CO |r|
Show InChI InChI=1S/C17H35NO5/c1-2-3-4-7-10-23-11-8-5-6-9-18-12-15(20)17(22)16(21)14(18)13-19/h14-17,19-22H,2-13H2,1H3/t14-,15+,16-,17-/m1/s1
Reactome pathway
n/an/a 1.00E+3n/an/an/an/an/an/a
TBA
Curated by ChEMBL
Assay Description
Inhibition of glucosylceramide synthase in mouse RAW cells preincubated with compound for 15 mins by in-situ enzyme inhibition assay
ACS Med Chem Lett 2: 119-123 (2011)
Article DOI: 10.1021/ml100192b
BindingDB Entry DOI: 10.7270/Q21C1X5H
alpha-glucosidase (Gaa)
(Mus musculus (Mouse))
BDBM50335390
(CHEMBL1651630 | N-Hexoxypentyl-1-deoxynojirimycin)
Show SMILES CCCCCCOCCCCCN1C[C@H](O)[C@@H](O)[C@H](O)[C@H]1CO |r|
Show InChI InChI=1S/C17H35NO5/c1-2-3-4-7-10-23-11-8-5-6-9-18-12-15(20)17(22)16(21)14(18)13-19/h14-17,19-22H,2-13H2,1H3/t14-,15+,16-,17-/m1/s1
n/an/a 5.00E+3n/an/an/an/an/an/a
TBA
Curated by ChEMBL
Assay Description
Inhibition of maltase in mouse intestinal input by glucose release assay
ACS Med Chem Lett 2: 119-123 (2011)
Article DOI: 10.1021/ml100192b
BindingDB Entry DOI: 10.7270/Q21C1X5H
Lysosomal acid glucosylceramidase
(Homo sapiens (Human))
BDBM50335390
(CHEMBL1651630 | N-Hexoxypentyl-1-deoxynojirimycin)
Show SMILES CCCCCCOCCCCCN1C[C@H](O)[C@@H](O)[C@H](O)[C@H]1CO |r|
Show InChI InChI=1S/C17H35NO5/c1-2-3-4-7-10-23-11-8-5-6-9-18-12-15(20)17(22)16(21)14(18)13-19/h14-17,19-22H,2-13H2,1H3/t14-,15+,16-,17-/m1/s1
Reactome pathway
n/an/a 5.40E+3n/an/an/an/an/an/a
University of Napoli Federico II
Curated by ChEMBL
Assay Description
Inhibition of GCase in human SH-SY5Y cells using MUG-Gluc as fluorogenic substrate preincubated for 30 mins followed by substrate addition and measur...
Eur J Med Chem 175: 63-71 (2019)
Article DOI: 10.1016/j.ejmech.2019.04.061
Sucrase-isomaltase
(Mus musculus)
BDBM50335390
(CHEMBL1651630 | N-Hexoxypentyl-1-deoxynojirimycin)
Show SMILES CCCCCCOCCCCCN1C[C@H](O)[C@@H](O)[C@H](O)[C@H]1CO |r|
Show InChI InChI=1S/C17H35NO5/c1-2-3-4-7-10-23-11-8-5-6-9-18-12-15(20)17(22)16(21)14(18)13-19/h14-17,19-22H,2-13H2,1H3/t14-,15+,16-,17-/m1/s1
n/an/a 800n/an/an/an/an/an/a
TBA
Curated by ChEMBL
Assay Description
Inhibition of sucrase in mouse intestinal input by glucose release assay
ACS Med Chem Lett 2: 119-123 (2011)
Article DOI: 10.1021/ml100192b
BindingDB Entry DOI: 10.7270/Q21C1X5H
Beta-glucosidase
(Homo sapiens (Human))
BDBM50335390
(CHEMBL1651630 | N-Hexoxypentyl-1-deoxynojirimycin)
Show SMILES CCCCCCOCCCCCN1C[C@H](O)[C@@H](O)[C@H](O)[C@H]1CO |r|
Show InChI InChI=1S/C17H35NO5/c1-2-3-4-7-10-23-11-8-5-6-9-18-12-15(20)17(22)16(21)14(18)13-19/h14-17,19-22H,2-13H2,1H3/t14-,15+,16-,17-/m1/s1
Reactome pathway
n/an/a 8n/an/an/an/an/an/a
TBA
Curated by ChEMBL
Assay Description
Inhibition of recombinant GBA2 preincuabated with compound for 30 mins using 4-methylumbelliferyl-B-glucoside substrate by fluorimetric assay
ACS Med Chem Lett 2: 119-123 (2011)
Article DOI: 10.1021/ml100192b
BindingDB Entry DOI: 10.7270/Q21C1X5H
Beta-glucosidase
(Homo sapiens (Human))
BDBM50335390
(CHEMBL1651630 | N-Hexoxypentyl-1-deoxynojirimycin)
Show SMILES CCCCCCOCCCCCN1C[C@H](O)[C@@H](O)[C@H](O)[C@H]1CO |r|
Show InChI InChI=1S/C17H35NO5/c1-2-3-4-7-10-23-11-8-5-6-9-18-12-15(20)17(22)16(21)14(18)13-19/h14-17,19-22H,2-13H2,1H3/t14-,15+,16-,17-/m1/s1
Reactome pathway
n/an/a 0.400n/an/an/an/an/an/a
University of Napoli Federico II
Curated by ChEMBL
Assay Description
Inhibition of NLGase in human SH-SY5Y cells using MUG-Gluc as fluorogenic substrate preincubated for 30 mins followed by substrate addition and measu...
Eur J Med Chem 175: 63-71 (2019)
Article DOI: 10.1016/j.ejmech.2019.04.061
Beta-galactosidase
(Mus musculus)
BDBM50335390
(CHEMBL1651630 | N-Hexoxypentyl-1-deoxynojirimycin)
Show SMILES CCCCCCOCCCCCN1C[C@H](O)[C@@H](O)[C@H](O)[C@H]1CO |r|
Show InChI InChI=1S/C17H35NO5/c1-2-3-4-7-10-23-11-8-5-6-9-18-12-15(20)17(22)16(21)14(18)13-19/h14-17,19-22H,2-13H2,1H3/t14-,15+,16-,17-/m1/s1
Reactome pathway
n/an/a 2.00E+5n/an/an/an/an/an/a
TBA
Curated by ChEMBL
Assay Description
Inhibition of lactase in mouse intestinal input by glucose release assay
ACS Med Chem Lett 2: 119-123 (2011)
Article DOI: 10.1021/ml100192b
BindingDB Entry DOI: 10.7270/Q21C1X5H