BDBM50335464 1-(4-(5-(cyclopentylmethoxy)benzofuran-2-yl)-3-fluorobenzyl)azetidine-3-carboxylic acid::CHEMBL1651719
SMILES: OC(=O)C1CN(Cc2ccc(-c3cc4cc(OCC5CCCC5)ccc4o3)c(F)c2)C1
InChI Key: InChIKey=FRFMAYDLFUKCGC-UHFFFAOYSA-N
Data: 2 EC50
Activity Spreadsheet -- Enzyme Inhibition Constant Data from BindingDB
Found 2 hits for monomerid = 50335464
Trg + Lig
Ki
nM
ΔG°
kcal/mole
IC50
nM
Kd
nM
EC50/IC50
nM
koff
s-1
kon
M-1s-1
pHTemp
°C
Sphingosine 1-phosphate receptor 1
(Homo sapiens (Human))
BDBM50335464
(1-(4-(5-(cyclopentylmethoxy)benzofuran-2-yl)-3-flu...)
Show SMILES OC(=O)C1CN(Cc2ccc(-c3cc4cc(OCC5CCCC5)ccc4o3)c(F)c2)C1
Show InChI InChI=1S/C25H26FNO4/c26-22-9-17(12-27-13-19(14-27)25(28)29)5-7-21(22)24-11-18-10-20(6-8-23(18)31-24)30-15-16-3-1-2-4-16/h5-11,16,19H,1-4,12-15H2,(H,28,29)
Reactome pathway
n/an/an/an/a 454n/an/an/an/a
TBA
Curated by ChEMBL
Assay Description
Induction of human GFP-tagged chimeric S1P1R internalization in human U2Os cells by fluorescence microscopy
ACS Med Chem Lett 2: 97-101 (2011)
Article DOI: 10.1021/ml100227q
BindingDB Entry DOI: 10.7270/Q2WM1DP6
Sphingosine 1-phosphate receptor 3
(Homo sapiens (Human))
BDBM50335464
(1-(4-(5-(cyclopentylmethoxy)benzofuran-2-yl)-3-flu...)
Show SMILES OC(=O)C1CN(Cc2ccc(-c3cc4cc(OCC5CCCC5)ccc4o3)c(F)c2)C1
Show InChI InChI=1S/C25H26FNO4/c26-22-9-17(12-27-13-19(14-27)25(28)29)5-7-21(22)24-11-18-10-20(6-8-23(18)31-24)30-15-16-3-1-2-4-16/h5-11,16,19H,1-4,12-15H2,(H,28,29)
NCI pathway
Reactome pathway
n/an/an/an/a>2.50E+4n/an/an/an/a
TBA
Curated by ChEMBL
Assay Description
Agonist activity at human S1P3R expressed in CHO cells by Ca(2+) mobilization assay
ACS Med Chem Lett 2: 97-101 (2011)
Article DOI: 10.1021/ml100227q
BindingDB Entry DOI: 10.7270/Q2WM1DP6