BDBM50335687 2-(4-((3S,4R)-4-(2-hydroxypropan-2-yl)pyrrolidin-3-ylamino)quinazolin-2-yl)-4-(1H-pyrazol-3-yl)phenol::CHEMBL1650131
SMILES: CC(C)(O)[C@@H]1CNC[C@H]1Nc1nc(nc2ccccc12)-c1cc(ccc1O)-c1cc[nH]n1
InChI Key: InChIKey=SILRSPQRNMXQEN-YLJYHZDGSA-N
Data: 2 IC50
Activity Spreadsheet -- Enzyme Inhibition Constant Data from BindingDB
Found 2 hits for monomerid = 50335687
Trg + Lig
Ki
nM
ΔG°
kcal/mole
IC50
nM
Kd
nM
EC50/IC50
nM
koff
s-1
kon
M-1s-1
pHTemp
°C
Serine/threonine-protein kinase CHK2
(Homo sapiens (Human))
BDBM50335687
(2-(4-((3S,4R)-4-(2-hydroxypropan-2-yl)pyrrolidin-3...)
Show SMILES CC(C)(O)[C@@H]1CNC[C@H]1Nc1nc(nc2ccccc12)-c1cc(ccc1O)-c1cc[nH]n1 |r|
Show InChI InChI=1S/C24H26N6O2/c1-24(2,32)17-12-25-13-20(17)28-22-15-5-3-4-6-19(15)27-23(29-22)16-11-14(7-8-21(16)31)18-9-10-26-30-18/h3-11,17,20,25,31-32H,12-13H2,1-2H3,(H,26,30)(H,27,28,29)/t17-,20-/m1/s1
n/an/a 8n/an/an/an/an/an/a
Institute of Cancer Research
Curated by ChEMBL
Assay Description
Inhibition of CHK2 by DELFIA assay
J Med Chem 54: 580-90 (2011)
Article DOI: 10.1021/jm101150b
BindingDB Entry DOI: 10.7270/Q2DF6RHX
Serine/threonine-protein kinase Chk1
(Homo sapiens (Human))
BDBM50335687
(2-(4-((3S,4R)-4-(2-hydroxypropan-2-yl)pyrrolidin-3...)
Show SMILES CC(C)(O)[C@@H]1CNC[C@H]1Nc1nc(nc2ccccc12)-c1cc(ccc1O)-c1cc[nH]n1 |r|
Show InChI InChI=1S/C24H26N6O2/c1-24(2,32)17-12-25-13-20(17)28-22-15-5-3-4-6-19(15)27-23(29-22)16-11-14(7-8-21(16)31)18-9-10-26-30-18/h3-11,17,20,25,31-32H,12-13H2,1-2H3,(H,26,30)(H,27,28,29)/t17-,20-/m1/s1
Reactome pathway
n/an/a 4.65E+3n/an/an/an/an/an/a
Institute of Cancer Research
Curated by ChEMBL
Assay Description
Inhibition of CHK1 by DELFIA assay
J Med Chem 54: 580-90 (2011)
Article DOI: 10.1021/jm101150b
BindingDB Entry DOI: 10.7270/Q2DF6RHX