BDBM50336089 (S)-N-(1-cyanocyclopropyl)-2-((S)-2,2-difluoro-1-(4'-(methylsulfonyl)biphenyl-4-yl)ethylamino)-4-methylpentanamide::CHEMBL1669436
SMILES: CC(C)C[C@H](N[C@H](C(F)F)c1ccc(cc1)-c1ccc(cc1)S(C)(=O)=O)C(=O)NC1(CC1)C#N
InChI Key: InChIKey=GUVSWVNKOKQLPD-VXKWHMMOSA-N
Data: 1 IC50
Activity Spreadsheet -- Enzyme Inhibition Constant Data from BindingDB
Found 1 hit for monomerid = 50336089
Trg + Lig
Ki
nM
ΔG°
kcal/mole
IC50
nM
Kd
nM
EC50/IC50
nM
koff
s-1
kon
M-1s-1
pHTemp
°C
Cathepsin K
(Homo sapiens (Human))
BDBM50336089
((S)-N-(1-cyanocyclopropyl)-2-((S)-2,2-difluoro-1-(...)
Show SMILES CC(C)C[C@H](N[C@H](C(F)F)c1ccc(cc1)-c1ccc(cc1)S(C)(=O)=O)C(=O)NC1(CC1)C#N |r|
Show InChI InChI=1S/C25H29F2N3O3S/c1-16(2)14-21(24(31)30-25(15-28)12-13-25)29-22(23(26)27)19-6-4-17(5-7-19)18-8-10-20(11-9-18)34(3,32)33/h4-11,16,21-23,29H,12-14H2,1-3H3,(H,30,31)/t21-,22-/m0/s1
Reactome pathway
n/an/a 0.800n/an/an/an/an/an/a
Merck Frosst Centre for Therapeutic Research
Curated by ChEMBL
Assay Description
Inhibition of humanized rabbit cathepsin K
Bioorg Med Chem Lett 21: 920-3 (2011)
Article DOI: 10.1016/j.bmcl.2010.12.070
BindingDB Entry DOI: 10.7270/Q2Z89CQF