BDBM50336182 4-(4-{[3-Carbamoyl-1-(4-fluorophenyl)-4,5-dihydro-1H-benzo[g]indazol-8-yl]carbamoyl}-5-chloropyridin-2-yl)-1-[(1-methyl-1H-pyrazol-4-yl)methyl]piperazine-2-carboxylicacid::CHEMBL1669570
SMILES: Cn1cc(CN2CCN(CC2C(O)=O)c2cc(C(=O)Nc3ccc4CCc5c(nn(c5-c4c3)-c3ccc(F)cc3)C(N)=O)c(Cl)cn2)cn1
InChI Key: InChIKey=YZGWZCOIRRVTDL-UHFFFAOYSA-N
Data: 1 IC50
Activity Spreadsheet -- Enzyme Inhibition Constant Data from BindingDB
Found 1 hit for monomerid = 50336182
Trg + Lig
Ki
nM
ΔG°
kcal/mole
IC50
nM
Kd
nM
EC50/IC50
nM
koff
s-1
kon
M-1s-1
pHTemp
°C
Inhibitor of nuclear factor kappa-B kinase subunit beta
(Homo sapiens (Human))
BDBM50336182
(4-(4-{[3-Carbamoyl-1-(4-fluorophenyl)-4,5-dihydro-...)
Show SMILES Cn1cc(CN2CCN(CC2C(O)=O)c2cc(C(=O)Nc3ccc4CCc5c(nn(c5-c4c3)-c3ccc(F)cc3)C(N)=O)c(Cl)cn2)cn1
Show InChI InChI=1S/C34H31ClFN9O4/c1-42-16-19(14-39-42)17-43-10-11-44(18-28(43)34(48)49)29-13-26(27(35)15-38-29)33(47)40-22-6-2-20-3-9-24-30(32(37)46)41-45(31(24)25(20)12-22)23-7-4-21(36)5-8-23/h2,4-8,12-16,28H,3,9-11,17-18H2,1H3,(H2,37,46)(H,40,47)(H,48,49)
NCI pathway
Reactome pathway
n/an/a 3.90n/an/an/an/an/an/a
Pfizer Inc.
Curated by ChEMBL
Assay Description
Inhibition of human recombinant IKK2 in human PBMC
Bioorg Med Chem 19: 1242-55 (2011)
Article DOI: 10.1016/j.bmc.2010.12.027
BindingDB Entry DOI: 10.7270/Q2F76CTN