BDBM50336323 CHEMBL1667941::trans-4-(8-amino-1-(8-fluoro-2-phenylquinolin-7-yl)imidazo[1,5-a]pyrazin-3-yl)-N-(1,3,4-thiadiazol-2-yl)cyclohexanecarboxamide
SMILES: Nc1nccn2c(nc(-c3ccc4ccc(nc4c3F)-c3ccccc3)c12)[C@H]1CC[C@@H](CC1)C(=O)Nc1nncs1
InChI Key: InChIKey=IYHDQGNBIDQYLJ-MXVIHJGJSA-N
Data: 1 IC50
Activity Spreadsheet -- Enzyme Inhibition Constant Data from BindingDB
Found 1 hit for monomerid = 50336323
Trg + Lig
Ki
nM
ΔG°
kcal/mole
IC50
nM
Kd
nM
EC50/IC50
nM
koff
s-1
kon
M-1s-1
pHTemp
°C
Insulin-like growth factor 1 receptor
(Homo sapiens (Human))
BDBM50336323
(CHEMBL1667941 | trans-4-(8-amino-1-(8-fluoro-2-phe...)
Show SMILES Nc1nccn2c(nc(-c3ccc4ccc(nc4c3F)-c3ccccc3)c12)[C@H]1CC[C@@H](CC1)C(=O)Nc1nncs1 |r,wU:27.31,wD:30.38,(36.37,-27.21,;36.37,-28.75,;35.04,-29.52,;35.04,-31.06,;36.38,-31.83,;37.72,-31.05,;39.19,-31.52,;40.09,-30.27,;39.17,-29.02,;39.94,-27.7,;39.17,-26.37,;39.94,-25.04,;41.49,-25.04,;42.25,-23.71,;43.78,-23.71,;44.55,-25.04,;43.78,-26.37,;42.25,-26.37,;41.48,-27.7,;42.25,-29.04,;46.09,-25.04,;46.85,-26.38,;48.39,-26.38,;49.16,-25.04,;48.39,-23.7,;46.85,-23.71,;37.71,-29.51,;39.67,-32.98,;41.18,-33.28,;41.66,-34.75,;40.63,-35.9,;39.12,-35.58,;38.64,-34.12,;41.11,-37.36,;40.32,-38.69,;42.65,-37.38,;43.4,-38.72,;44.94,-38.9,;45.24,-40.41,;43.9,-41.16,;42.77,-40.12,)|
Show InChI InChI=1S/C30H25FN8OS/c31-23-21(12-10-18-11-13-22(35-24(18)23)17-4-2-1-3-5-17)25-26-27(32)33-14-15-39(26)28(36-25)19-6-8-20(9-7-19)29(40)37-30-38-34-16-41-30/h1-5,10-16,19-20H,6-9H2,(H2,32,33)(H,37,38,40)/t19-,20-
Reactome pathway
n/an/a 5n/an/an/an/an/an/a
OSI Pharmaceuticals, Inc.
Curated by ChEMBL
Assay Description
Inhibition of human IGF1R expressed in mouse 3T3 cells by ELISA based assay
Bioorg Med Chem Lett 21: 1176-80 (2011)
Article DOI: 10.1016/j.bmcl.2010.12.094
BindingDB Entry DOI: 10.7270/Q2J103DJ