BDBM50336327 CHEMBL1667945::trans-4-(8-amino-1-(8-fluoro-2-phenylquinolin-7-yl)imidazo[1,5-a]pyrazin-3-yl)-N-(pyridin-2-yl)cyclohexanecarboxamide
SMILES: Nc1nccn2c(nc(-c3ccc4ccc(nc4c3F)-c3ccccc3)c12)[C@H]1CC[C@@H](CC1)C(=O)Nc1ccccn1
InChI Key: InChIKey=MOBOQJSKEGEPRI-YHBQERECSA-N
Data: 1 IC50
Activity Spreadsheet -- Enzyme Inhibition Constant Data from BindingDB
Found 1 hit for monomerid = 50336327
Trg + Lig
Ki
nM
ΔG°
kcal/mole
IC50
nM
Kd
nM
EC50/IC50
nM
koff
s-1
kon
M-1s-1
pHTemp
°C
Insulin-like growth factor 1 receptor
(Homo sapiens (Human))
BDBM50336327
(CHEMBL1667945 | trans-4-(8-amino-1-(8-fluoro-2-phe...)
Show SMILES Nc1nccn2c(nc(-c3ccc4ccc(nc4c3F)-c3ccccc3)c12)[C@H]1CC[C@@H](CC1)C(=O)Nc1ccccn1 |r,wU:27.31,wD:30.38,(-8.63,-16.09,;-8.62,-17.63,;-9.95,-18.4,;-9.95,-19.94,;-8.62,-20.71,;-7.28,-19.93,;-5.81,-20.4,;-4.91,-19.15,;-5.82,-17.91,;-5.05,-16.58,;-5.82,-15.25,;-5.06,-13.92,;-3.51,-13.92,;-2.75,-12.59,;-1.22,-12.59,;-.44,-13.92,;-1.21,-15.25,;-2.74,-15.25,;-3.51,-16.58,;-2.74,-17.92,;1.09,-13.92,;1.86,-15.26,;3.4,-15.26,;4.17,-13.92,;3.39,-12.58,;1.85,-12.59,;-7.29,-18.39,;-5.32,-21.86,;-3.82,-22.16,;-3.34,-23.63,;-4.37,-24.78,;-5.87,-24.46,;-6.35,-23.01,;-3.89,-26.25,;-4.67,-27.57,;-2.35,-26.26,;-1.56,-24.94,;-.02,-24.96,;.76,-23.64,;.01,-22.29,;-1.54,-22.28,;-2.32,-23.61,)|
Show InChI InChI=1S/C33H28FN7O/c34-27-24(15-13-21-14-16-25(38-28(21)27)20-6-2-1-3-7-20)29-30-31(35)37-18-19-41(30)32(40-29)22-9-11-23(12-10-22)33(42)39-26-8-4-5-17-36-26/h1-8,13-19,22-23H,9-12H2,(H2,35,37)(H,36,39,42)/t22-,23-
Reactome pathway
n/an/a 5n/an/an/an/an/an/a
OSI Pharmaceuticals, Inc.
Curated by ChEMBL
Assay Description
Inhibition of human IGF1R expressed in mouse 3T3 cells by ELISA based assay
Bioorg Med Chem Lett 21: 1176-80 (2011)
Article DOI: 10.1016/j.bmcl.2010.12.094
BindingDB Entry DOI: 10.7270/Q2J103DJ