BDBM50336328 CHEMBL1667946::trans-4-(8-amino-1-(8-fluoro-2-phenylquinolin-7-yl)imidazo[1,5-a]pyrazin-3-yl)-N-(pyrimidin-4-yl)cyclohexanecarboxamide
SMILES: Nc1nccn2c(nc(-c3ccc4ccc(nc4c3F)-c3ccccc3)c12)[C@H]1CC[C@@H](CC1)C(=O)Nc1ccncn1
InChI Key: InChIKey=HXZDYAICGLTLCH-HZCBDIJESA-N
Data: 1 IC50
Activity Spreadsheet -- Enzyme Inhibition Constant Data from BindingDB
Found 1 hit for monomerid = 50336328
Trg + Lig
Ki
nM
ΔG°
kcal/mole
IC50
nM
Kd
nM
EC50/IC50
nM
koff
s-1
kon
M-1s-1
pHTemp
°C
Insulin-like growth factor 1 receptor
(Homo sapiens (Human))
BDBM50336328
(CHEMBL1667946 | trans-4-(8-amino-1-(8-fluoro-2-phe...)
Show SMILES Nc1nccn2c(nc(-c3ccc4ccc(nc4c3F)-c3ccccc3)c12)[C@H]1CC[C@@H](CC1)C(=O)Nc1ccncn1 |r,wU:27.31,wD:30.38,(5.26,-16.47,;5.26,-18.01,;3.93,-18.78,;3.93,-20.33,;5.27,-21.1,;6.61,-20.32,;8.08,-20.79,;8.98,-19.53,;8.06,-18.29,;8.83,-16.97,;8.07,-15.64,;8.83,-14.3,;10.38,-14.3,;11.14,-12.98,;12.67,-12.97,;13.45,-14.31,;12.68,-15.63,;11.14,-15.63,;10.38,-16.97,;11.15,-18.3,;14.98,-14.31,;15.75,-15.64,;17.29,-15.64,;18.06,-14.31,;17.28,-12.97,;15.74,-12.98,;6.6,-18.78,;8.56,-22.25,;10.07,-22.55,;10.55,-24.02,;9.52,-25.17,;8.01,-24.85,;7.54,-23.39,;10,-26.63,;9.22,-27.96,;11.54,-26.65,;12.33,-25.32,;13.87,-25.35,;14.65,-24.03,;13.89,-22.68,;12.35,-22.67,;11.57,-23.99,)|
Show InChI InChI=1S/C32H27FN8O/c33-26-23(12-10-20-11-13-24(38-27(20)26)19-4-2-1-3-5-19)28-29-30(34)36-16-17-41(29)31(40-28)21-6-8-22(9-7-21)32(42)39-25-14-15-35-18-37-25/h1-5,10-18,21-22H,6-9H2,(H2,34,36)(H,35,37,39,42)/t21-,22-
Reactome pathway
n/an/a 8n/an/an/an/an/an/a
OSI Pharmaceuticals, Inc.
Curated by ChEMBL
Assay Description
Inhibition of human IGF1R expressed in mouse 3T3 cells by ELISA based assay
Bioorg Med Chem Lett 21: 1176-80 (2011)
Article DOI: 10.1016/j.bmcl.2010.12.094
BindingDB Entry DOI: 10.7270/Q2J103DJ