null
SMILES: Cc1cc(C(=O)Nc2cn[nH]c2)c2nc(C)nc(N)c2c1
InChI Key: InChIKey=CSRASQPNXGJFFI-UHFFFAOYSA-N
Activity Spreadsheet -- Enzyme Inhibition Constant Data from BindingDB
Found 3 hits for monomerid = 50336408
Trg + Lig
Ki
nM
ΔG°
kcal/mole
IC50
nM
Kd
nM
EC50/IC50
nM
koff
s-1
kon
M-1s-1
pHTemp
°C
Phosphatidylinositol 4,5-bisphosphate 3-kinase catalytic subunit alpha isoform
(Homo sapiens (Human))
BDBM50336408
(4-amino-2,6-dimethyl-N-(1H-pyrazol-4-yl)quinazolin...)
Show SMILES Cc1cc(C(=O)Nc2cn[nH]c2)c2nc(C)nc(N)c2c1
Show InChI InChI=1S/C14H14N6O/c1-7-3-10-12(18-8(2)19-13(10)15)11(4-7)14(21)20-9-5-16-17-6-9/h3-6H,1-2H3,(H,16,17)(H,20,21)(H2,15,18,19)
NCI pathway
Reactome pathway
5n/an/an/an/an/an/an/an/a
Pfizer Inc.
Curated by ChEMBL
Assay Description
Inhibition of PI3Kalpha by fluorescene polarization assay
Bioorg Med Chem Lett 21: 1270-4 (2011)
Article DOI: 10.1016/j.bmcl.2010.12.026
BindingDB Entry DOI: 10.7270/Q2H1329M
Serine/threonine-protein kinase mTOR
(Homo sapiens (Human))
BDBM50336408
(4-amino-2,6-dimethyl-N-(1H-pyrazol-4-yl)quinazolin...)
Show SMILES Cc1cc(C(=O)Nc2cn[nH]c2)c2nc(C)nc(N)c2c1
Show InChI InChI=1S/C14H14N6O/c1-7-3-10-12(18-8(2)19-13(10)15)11(4-7)14(21)20-9-5-16-17-6-9/h3-6H,1-2H3,(H,16,17)(H,20,21)(H2,15,18,19)
NCI pathway
Reactome pathway
84n/an/an/an/an/an/an/an/a
Pfizer Inc.
Curated by ChEMBL
Assay Description
Inhibition of mTOR
Bioorg Med Chem Lett 21: 1270-4 (2011)
Article DOI: 10.1016/j.bmcl.2010.12.026
BindingDB Entry DOI: 10.7270/Q2H1329M
Phosphatidylinositol 4,5-bisphosphate 3-kinase catalytic subunit alpha isoform
(Homo sapiens (Human))
BDBM50336408
(4-amino-2,6-dimethyl-N-(1H-pyrazol-4-yl)quinazolin...)
Show SMILES Cc1cc(C(=O)Nc2cn[nH]c2)c2nc(C)nc(N)c2c1
Show InChI InChI=1S/C14H14N6O/c1-7-3-10-12(18-8(2)19-13(10)15)11(4-7)14(21)20-9-5-16-17-6-9/h3-6H,1-2H3,(H,16,17)(H,20,21)(H2,15,18,19)
NCI pathway
Reactome pathway
n/an/a 24n/an/an/an/an/an/a
Pfizer Inc.
Curated by ChEMBL
Assay Description
Inhibition of PI3Kalpha-phosphorylation at S473 residue in human BT20 cells
Bioorg Med Chem Lett 21: 1270-4 (2011)
Article DOI: 10.1016/j.bmcl.2010.12.026
BindingDB Entry DOI: 10.7270/Q2H1329M