BDBM50336465 (3S,5R)-5-chloro-16-hydroxy-14-methoxy-3-methyl-3,4,5,6,9,10,11,12-octahydro-1H-benzo[c][1]oxacyclotetradecine-1,7(8H)-dione::CHEMBL1668413
SMILES: COc1cc(O)c2c(CCCCCC(=O)C[C@H](Cl)C[C@H](C)OC2=O)c1
InChI Key: InChIKey=GLRILJLJSBHYAR-GXTWGEPZSA-N
Data: 5 IC50
Activity Spreadsheet -- Enzyme Inhibition Constant Data from BindingDB
Found 5 hits for monomerid = 50336465
Trg + Lig
Ki
nM
ΔG°
kcal/mole
IC50
nM
Kd
nM
EC50/IC50
nM
koff
s-1
kon
M-1s-1
pHTemp
°C
Vascular endothelial growth factor receptor 3
(Homo sapiens (Human))
BDBM50336465
((3S,5R)-5-chloro-16-hydroxy-14-methoxy-3-methyl-3,...)
Show SMILES COc1cc(O)c2c(CCCCCC(=O)C[C@H](Cl)C[C@H](C)OC2=O)c1 |r|
Show InChI InChI=1S/C19H25ClO5/c1-12-8-14(20)10-15(21)7-5-3-4-6-13-9-16(24-2)11-17(22)18(13)19(23)25-12/h9,11-12,14,22H,3-8,10H2,1-2H3/t12-,14+/m0/s1
n/an/a 1.70E+4n/an/an/an/an/an/a
National University of Ireland
Curated by ChEMBL
Assay Description
Inhibition of human recombinant VEGFR3 in cell free system after 90 mins
Bioorg Med Chem Lett 21: 1167-70 (2011)
Article DOI: 10.1016/j.bmcl.2010.12.100
BindingDB Entry DOI: 10.7270/Q23T9HH5
Mast/stem cell growth factor receptor Kit
(Homo sapiens (Human))
BDBM50336465
((3S,5R)-5-chloro-16-hydroxy-14-methoxy-3-methyl-3,...)
Show SMILES COc1cc(O)c2c(CCCCCC(=O)C[C@H](Cl)C[C@H](C)OC2=O)c1 |r|
Show InChI InChI=1S/C19H25ClO5/c1-12-8-14(20)10-15(21)7-5-3-4-6-13-9-16(24-2)11-17(22)18(13)19(23)25-12/h9,11-12,14,22H,3-8,10H2,1-2H3/t12-,14+/m0/s1
n/an/a 4.70E+4n/an/an/an/an/an/a
National University of Ireland
Curated by ChEMBL
Assay Description
Inhibition of human recombinant c-kit kinase in cell free system after 30 mins
Bioorg Med Chem Lett 21: 1167-70 (2011)
Article DOI: 10.1016/j.bmcl.2010.12.100
BindingDB Entry DOI: 10.7270/Q23T9HH5
Vascular endothelial growth factor receptor 2
(Homo sapiens (Human))
BDBM50336465
((3S,5R)-5-chloro-16-hydroxy-14-methoxy-3-methyl-3,...)
Show SMILES COc1cc(O)c2c(CCCCCC(=O)C[C@H](Cl)C[C@H](C)OC2=O)c1 |r|
Show InChI InChI=1S/C19H25ClO5/c1-12-8-14(20)10-15(21)7-5-3-4-6-13-9-16(24-2)11-17(22)18(13)19(23)25-12/h9,11-12,14,22H,3-8,10H2,1-2H3/t12-,14+/m0/s1
NCI pathway
Reactome pathway
n/an/a 9.30E+4n/an/an/an/an/an/a
National University of Ireland
Curated by ChEMBL
Assay Description
Inhibition of human recombinant VEGFR2 expressed in Sf9 cells after 60 mins
Bioorg Med Chem Lett 21: 1167-70 (2011)
Article DOI: 10.1016/j.bmcl.2010.12.100
BindingDB Entry DOI: 10.7270/Q23T9HH5
Receptor-type tyrosine-protein kinase FLT3
(Homo sapiens (Human))
BDBM50336465
((3S,5R)-5-chloro-16-hydroxy-14-methoxy-3-methyl-3,...)
Show SMILES COc1cc(O)c2c(CCCCCC(=O)C[C@H](Cl)C[C@H](C)OC2=O)c1 |r|
Show InChI InChI=1S/C19H25ClO5/c1-12-8-14(20)10-15(21)7-5-3-4-6-13-9-16(24-2)11-17(22)18(13)19(23)25-12/h9,11-12,14,22H,3-8,10H2,1-2H3/t12-,14+/m0/s1
n/an/a 1.60E+4n/an/an/an/an/an/a
National University of Ireland
Curated by ChEMBL
Assay Description
Inhibition of human recombinant FLT-3 kinase expressed in insect cells after 90 mins
Bioorg Med Chem Lett 21: 1167-70 (2011)
Article DOI: 10.1016/j.bmcl.2010.12.100
BindingDB Entry DOI: 10.7270/Q23T9HH5
Platelet-derived growth factor receptor alpha
(Homo sapiens (Human))
BDBM50336465
((3S,5R)-5-chloro-16-hydroxy-14-methoxy-3-methyl-3,...)
Show SMILES COc1cc(O)c2c(CCCCCC(=O)C[C@H](Cl)C[C@H](C)OC2=O)c1 |r|
Show InChI InChI=1S/C19H25ClO5/c1-12-8-14(20)10-15(21)7-5-3-4-6-13-9-16(24-2)11-17(22)18(13)19(23)25-12/h9,11-12,14,22H,3-8,10H2,1-2H3/t12-,14+/m0/s1
n/an/a 1.40E+3n/an/an/an/an/an/a
National University of Ireland
Curated by ChEMBL
Assay Description
Inhibition of human recombinant PDGFRalpha in cell free system after 60 mins
Bioorg Med Chem Lett 21: 1167-70 (2011)
Article DOI: 10.1016/j.bmcl.2010.12.100
BindingDB Entry DOI: 10.7270/Q23T9HH5