null
SMILES: CCc1nn(CC(=O)NCCCN2C[C@H](C)C[C@@H](C)C2)c(=O)c2cc3sc(C)cc3n12
InChI Key: InChIKey=GMWVIRPICOOFSA-HZPDHXFCSA-N
Activity Spreadsheet -- Enzyme Inhibition Constant Data from BindingDB
Found 1 hit for monomerid = 50336467
Trg + Lig
Ki
nM
ΔG°
kcal/mole
IC50
nM
Kd
nM
EC50/IC50
nM
koff
s-1
kon
M-1s-1
pHTemp
°C
Acetylcholinesterase
(Electrophorus electricus (Electric eel))
BDBM50336467
(CHEMBL1668489 | N-[3-((3R,5R)-3,5-Dimethyl-piperid...)
Show SMILES CCc1nn(CC(=O)NCCCN2C[C@H](C)C[C@@H](C)C2)c(=O)c2cc3sc(C)cc3n12 |r|
Show InChI InChI=1S/C23H33N5O2S/c1-5-21-25-27(23(30)19-11-20-18(28(19)21)10-17(4)31-20)14-22(29)24-7-6-8-26-12-15(2)9-16(3)13-26/h10-11,15-16H,5-9,12-14H2,1-4H3,(H,24,29)/t15-,16-/m1/s1
n/an/a 2.00E+3n/an/an/an/an/an/a
National Institute of Pharmaceutical Education and Research (NIPER)
Curated by ChEMBL
Assay Description
Inhibition of electric eel AChE by Ellman's method
Bioorg Med Chem Lett 21: 1105-12 (2011)
Article DOI: 10.1016/j.bmcl.2010.12.131
BindingDB Entry DOI: 10.7270/Q2V988B9