null
SMILES: O=C(C1CCN(CC1)c1nnc(s1)N1CCCC1=O)N1CCCCCC1
InChI Key: InChIKey=JPFZNQBBVXGNGG-UHFFFAOYSA-N
Activity Spreadsheet -- Enzyme Inhibition Constant Data from BindingDB
Found 1 hit for monomerid = 50336468
Trg + Lig
Ki
nM
ΔG°
kcal/mole
IC50
nM
Kd
nM
EC50/IC50
nM
koff
s-1
kon
M-1s-1
pHTemp
°C
Acetylcholinesterase
(Electrophorus electricus (Electric eel))
BDBM50336468
(1-(5-(4-(azepane-1-carbonyl)piperidin-1-yl)-1,3,4-...)
Show SMILES O=C(C1CCN(CC1)c1nnc(s1)N1CCCC1=O)N1CCCCCC1
Show InChI InChI=1S/C18H27N5O2S/c24-15-6-5-11-23(15)18-20-19-17(26-18)22-12-7-14(8-13-22)16(25)21-9-3-1-2-4-10-21/h14H,1-13H2
n/an/a 1.00E+3n/an/an/an/an/an/a
National Institute of Pharmaceutical Education and Research (NIPER)
Curated by ChEMBL
Assay Description
Inhibition of electric eel AChE by Ellman's method
Bioorg Med Chem Lett 21: 1105-12 (2011)
Article DOI: 10.1016/j.bmcl.2010.12.131
BindingDB Entry DOI: 10.7270/Q2V988B9