null
SMILES: Clc1cc(NC(=O)CN2CCCCC2)ccc1NC(=O)CN1CCCCC1
InChI Key: InChIKey=PDPUOFINGQMZFJ-UHFFFAOYSA-N
Activity Spreadsheet -- Enzyme Inhibition Constant Data from BindingDB
Found 1 hit for monomerid = 50336469
Trg + Lig
Ki
nM
ΔG°
kcal/mole
IC50
nM
Kd
nM
EC50/IC50
nM
koff
s-1
kon
M-1s-1
pHTemp
°C
Acetylcholinesterase
(Electrophorus electricus (Electric eel))
BDBM50336469
(CHEMBL1668491 | N,N'-(2-chloro-1,4-phenylene)bis(2...)
Show SMILES Clc1cc(NC(=O)CN2CCCCC2)ccc1NC(=O)CN1CCCCC1
Show InChI InChI=1S/C20H29ClN4O2/c21-17-13-16(22-19(26)14-24-9-3-1-4-10-24)7-8-18(17)23-20(27)15-25-11-5-2-6-12-25/h7-8,13H,1-6,9-12,14-15H2,(H,22,26)(H,23,27)
n/an/a 1.00E+3n/an/an/an/an/an/a
National Institute of Pharmaceutical Education and Research (NIPER)
Curated by ChEMBL
Assay Description
Inhibition of electric eel AChE by Ellman's method
Bioorg Med Chem Lett 21: 1105-12 (2011)
Article DOI: 10.1016/j.bmcl.2010.12.131
BindingDB Entry DOI: 10.7270/Q2V988B9