null
SMILES: COc1ccc(Br)cc1C(=O)Nc1ccc(CN2CCCCC2)cc1
InChI Key: InChIKey=SAORHWBYGVHZGA-UHFFFAOYSA-N
Activity Spreadsheet -- Enzyme Inhibition Constant Data from BindingDB
Found 1 hit for monomerid = 50336472
Trg + Lig
Ki
nM
ΔG°
kcal/mole
IC50
nM
Kd
nM
EC50/IC50
nM
koff
s-1
kon
M-1s-1
pHTemp
°C
Acetylcholinesterase
(Electrophorus electricus (Electric eel))
BDBM50336472
(5-bromo-2-methoxy-N-(4-(piperidin-1-ylmethyl)pheny...)
Show SMILES COc1ccc(Br)cc1C(=O)Nc1ccc(CN2CCCCC2)cc1
Show InChI InChI=1S/C20H23BrN2O2/c1-25-19-10-7-16(21)13-18(19)20(24)22-17-8-5-15(6-9-17)14-23-11-3-2-4-12-23/h5-10,13H,2-4,11-12,14H2,1H3,(H,22,24)
n/an/a 1.00E+3n/an/an/an/an/an/a
National Institute of Pharmaceutical Education and Research (NIPER)
Curated by ChEMBL
Assay Description
Inhibition of electric eel AChE by Ellman's method
Bioorg Med Chem Lett 21: 1105-12 (2011)
Article DOI: 10.1016/j.bmcl.2010.12.131
BindingDB Entry DOI: 10.7270/Q2V988B9