BDBM50336476 1,3,5-trihydroxy-2,8-bis(3-methylbut-2-enyl)-10-methyl-9-acridone::CHEMBL464846
SMILES: [#6]\[#6](-[#6])=[#6]\[#6]-c1c(-[#8])cc2n(-[#6])c3c(-[#8])ccc(-[#6]\[#6]=[#6](\[#6])-[#6])c3c(=O)c2c1-[#8]
InChI Key: InChIKey=DYCRIHPNHAPQTH-UHFFFAOYSA-N
Data: 1 KI  1 IC50
Activity Spreadsheet -- Enzyme Inhibition Constant Data from BindingDB
Found 2 hits for monomerid = 50336476
Trg + Lig
Ki
nM
ΔG°
kcal/mole
IC50
nM
Kd
nM
EC50/IC50
nM
koff
s-1
kon
M-1s-1
pHTemp
°C
Cathepsin L2
(Homo sapiens (Human))
BDBM50336476
(1,3,5-trihydroxy-2,8-bis(3-methylbut-2-enyl)-10-me...)
Show SMILES [#6]\[#6](-[#6])=[#6]\[#6]-c1c(-[#8])cc2n(-[#6])c3c(-[#8])ccc(-[#6]\[#6]=[#6](\[#6])-[#6])c3c(=O)c2c1-[#8]
Show InChI InChI=1S/C24H27NO4/c1-13(2)6-8-15-9-11-18(26)22-20(15)24(29)21-17(25(22)5)12-19(27)16(23(21)28)10-7-14(3)4/h6-7,9,11-12,26-28H,8,10H2,1-5H3
1.20E+3n/an/an/an/an/an/an/an/a
Universidade Federal de S£o Carlos
Curated by ChEMBL
Assay Description
Inhibition of human recombinant cathepsin V expressed in Pichia pastoris by Lineweaver-Burk double-reciprocal plots
Bioorg Med Chem 19: 1477-81 (2011)
Article DOI: 10.1016/j.bmc.2010.12.056
BindingDB Entry DOI: 10.7270/Q2QJ7HK4
Cathepsin L2
(Homo sapiens (Human))
BDBM50336476
(1,3,5-trihydroxy-2,8-bis(3-methylbut-2-enyl)-10-me...)
Show SMILES [#6]\[#6](-[#6])=[#6]\[#6]-c1c(-[#8])cc2n(-[#6])c3c(-[#8])ccc(-[#6]\[#6]=[#6](\[#6])-[#6])c3c(=O)c2c1-[#8]
Show InChI InChI=1S/C24H27NO4/c1-13(2)6-8-15-9-11-18(26)22-20(15)24(29)21-17(25(22)5)12-19(27)16(23(21)28)10-7-14(3)4/h6-7,9,11-12,26-28H,8,10H2,1-5H3
n/an/a 3.90E+3n/an/an/an/an/an/a
Universidade Federal de S£o Carlos
Curated by ChEMBL
Assay Description
Inhibition of human recombinant cathepsin V expressed in Pichia pastoris
Bioorg Med Chem 19: 1477-81 (2011)
Article DOI: 10.1016/j.bmc.2010.12.056
BindingDB Entry DOI: 10.7270/Q2QJ7HK4