BDBM50336482 CHEMBL1668599::citibrasine
SMILES: COc1c(OC)c(OC)c2n(C)c3c(O)cccc3c(=O)c2c1O
InChI Key: InChIKey=QYPQTPVQPNLXHV-UHFFFAOYSA-N
Data: 1 KI  1 IC50
Activity Spreadsheet -- Enzyme Inhibition Constant Data from BindingDB
Found 2 hits for monomerid = 50336482
Trg + Lig
Ki
nM
ΔG°
kcal/mole
IC50
nM
Kd
nM
EC50/IC50
nM
koff
s-1
kon
M-1s-1
pHTemp
°C
Cathepsin L2
(Homo sapiens (Human))
BDBM50336482
(CHEMBL1668599 | citibrasine)
Show SMILES COc1c(OC)c(OC)c2n(C)c3c(O)cccc3c(=O)c2c1O
Show InChI InChI=1S/C17H17NO6/c1-18-11-8(6-5-7-9(11)19)13(20)10-12(18)15(22-2)17(24-4)16(23-3)14(10)21/h5-7,19,21H,1-4H3
200n/an/an/an/an/an/an/an/a
Universidade Federal de S£o Carlos
Curated by ChEMBL
Assay Description
Inhibition of human recombinant cathepsin V expressed in Pichia pastoris by Lineweaver-Burk double-reciprocal plots
Bioorg Med Chem 19: 1477-81 (2011)
Article DOI: 10.1016/j.bmc.2010.12.056
BindingDB Entry DOI: 10.7270/Q2QJ7HK4
Cathepsin L2
(Homo sapiens (Human))
BDBM50336482
(CHEMBL1668599 | citibrasine)
Show SMILES COc1c(OC)c(OC)c2n(C)c3c(O)cccc3c(=O)c2c1O
Show InChI InChI=1S/C17H17NO6/c1-18-11-8(6-5-7-9(11)19)13(20)10-12(18)15(22-2)17(24-4)16(23-3)14(10)21/h5-7,19,21H,1-4H3
n/an/a 1.20E+3n/an/an/an/an/an/a
Universidade Federal de S£o Carlos
Curated by ChEMBL
Assay Description
Inhibition of human recombinant cathepsin V expressed in Pichia pastoris
Bioorg Med Chem 19: 1477-81 (2011)
Article DOI: 10.1016/j.bmc.2010.12.056
BindingDB Entry DOI: 10.7270/Q2QJ7HK4