BDBM50336514 (S)-Iclaprim::CHEMBL1673303
SMILES: COc1cc(Cc2cnc(N)nc2N)c2C=C[C@@H](Oc2c1OC)C1CC1
InChI Key: InChIKey=HWJPWWYTGBZDEG-CQSZACIVSA-N
Data: 1 IC50
PDB links: 1 PDB ID matches this monomer.
Activity Spreadsheet -- Enzyme Inhibition Constant Data from BindingDB
Found 1 hit for monomerid = 50336514
Trg + Lig
Ki
nM
ΔG°
kcal/mole
IC50
nM
Kd
nM
EC50/IC50
nM
koff
s-1
kon
M-1s-1
pHTemp
°C
Dihydrofolate Reductase (DHFR)
(Staphylococcus aureus)
BDBM50336514
((S)-Iclaprim | CHEMBL1673303)
Show SMILES COc1cc(Cc2cnc(N)nc2N)c2C=C[C@@H](Oc2c1OC)C1CC1 |r,c:16|
Show InChI InChI=1S/C19H22N4O3/c1-24-15-8-11(7-12-9-22-19(21)23-18(12)20)13-5-6-14(10-3-4-10)26-16(13)17(15)25-2/h5-6,8-10,14H,3-4,7H2,1-2H3,(H4,20,21,22,23)/t14-/m1/s1
n/an/a 2.40n/an/an/an/an/an/a
Oklahoma State University
Curated by ChEMBL
Assay Description
Inhibition of Staphylococcus aureus wild type recombinant DHFR by MTS assay
Antimicrob Agents Chemother 54: 3825-33 (2010)
Article DOI: 10.1128/AAC.00361-10
BindingDB Entry DOI: 10.7270/Q25M6604
3D
3D Structure (crystal)