BDBM50336763 4-(5-(2,5-dimethylphenyl)-1-methyl-1H-pyrazol-3-yl)phenol::CHEMBL1671990
SMILES: Cc1ccc(C)c(c1)-c1cc(nn1C)-c1ccc(O)cc1
InChI Key: InChIKey=IWYRPUOYJMGGCY-UHFFFAOYSA-N
Data: 1 EC50
Activity Spreadsheet -- Enzyme Inhibition Constant Data from BindingDB
Found 1 hit for monomerid = 50336763
Trg + Lig
Ki
nM
ΔG°
kcal/mole
IC50
nM
Kd
nM
EC50/IC50
nM
koff
s-1
kon
M-1s-1
pHTemp
°C
Estrogen-related receptor alpha
(Homo sapiens (Human))
BDBM50336763
(4-(5-(2,5-dimethylphenyl)-1-methyl-1H-pyrazol-3-yl...)
Show SMILES Cc1ccc(C)c(c1)-c1cc(nn1C)-c1ccc(O)cc1
Show InChI InChI=1S/C18H18N2O/c1-12-4-5-13(2)16(10-12)18-11-17(19-20(18)3)14-6-8-15(21)9-7-14/h4-11,21H,1-3H3
Reactome pathway
n/an/an/an/a 1.00E+3n/an/an/an/a
Johnson& Johnson Pharmaceutical Research and Development
Curated by ChEMBL
Assay Description
Antagonist activity at ERRalpha LBD expressed in HEK293 cells assessed as Gal4-SRC2 interaction by two hybrid luciferase reporter gene assay
J Med Chem 54: 788-808 (2012)
Article DOI: 10.1021/jm101063h
BindingDB Entry DOI: 10.7270/Q208668Q