null
SMILES: Nc1c(cc(Nc2cccc(Br)c2)c2C(=O)c3ccccc3C(=O)c12)S([O-])(=O)=O
InChI Key: InChIKey=HTYPARFZJKMPJI-UHFFFAOYSA-M
Activity Spreadsheet -- Enzyme Inhibition Constant Data from BindingDB
Found 3 hits for monomerid = 50336772
Trg + Lig
Ki
nM
ΔG°
kcal/mole
IC50
nM
Kd
nM
EC50/IC50
nM
koff
s-1
kon
M-1s-1
pHTemp
°C
P2X purinoceptor 2
(RAT)
BDBM50336772
(CHEMBL1672098 | sodium 1-amino-4-(3-bromophenylami...)
Show SMILES Nc1c(cc(Nc2cccc(Br)c2)c2C(=O)c3ccccc3C(=O)c12)S([O-])(=O)=O
Show InChI InChI=1S/C20H13BrN2O5S/c21-10-4-3-5-11(8-10)23-14-9-15(29(26,27)28)18(22)17-16(14)19(24)12-6-1-2-7-13(12)20(17)25/h1-9,23H,22H2,(H,26,27,28)/p-1
n/an/a 1.00E+3n/an/an/an/an/an/a
University of Bonn
Curated by ChEMBL
Assay Description
Antagonist activity against rat P2X2 receptor expressed in Xenopus laevis oocyte assessed as inhibition of alpha, beta-meATP-induced inward current b...
J Med Chem 54: 817-30 (2012)
Article DOI: 10.1021/jm1012193
BindingDB Entry DOI: 10.7270/Q2VH5PTG
P2Y purinoceptor 4
(Homo sapiens (Human))
BDBM50336772
(CHEMBL1672098 | sodium 1-amino-4-(3-bromophenylami...)
Show SMILES Nc1c(cc(Nc2cccc(Br)c2)c2C(=O)c3ccccc3C(=O)c12)S([O-])(=O)=O
Show InChI InChI=1S/C20H13BrN2O5S/c21-10-4-3-5-11(8-10)23-14-9-15(29(26,27)28)18(22)17-16(14)19(24)12-6-1-2-7-13(12)20(17)25/h1-9,23H,22H2,(H,26,27,28)/p-1
Reactome pathway
n/an/a 6.96E+3n/an/an/an/an/an/a
University of Bonn
Curated by ChEMBL
Assay Description
Antagonist activity at human P2Y4 receptor transfected in human 1321N1 cells assessed as inhibition of UTP-activated intracellular calcium mobilizati...
J Med Chem 60: 3020-3038 (2017)
Article DOI: 10.1021/acs.jmedchem.7b00030
BindingDB Entry DOI: 10.7270/Q2G73H15
P2X purinoceptor 4
(RAT)
BDBM50336772
(CHEMBL1672098 | sodium 1-amino-4-(3-bromophenylami...)
Show SMILES Nc1c(cc(Nc2cccc(Br)c2)c2C(=O)c3ccccc3C(=O)c12)S([O-])(=O)=O
Show InChI InChI=1S/C20H13BrN2O5S/c21-10-4-3-5-11(8-10)23-14-9-15(29(26,27)28)18(22)17-16(14)19(24)12-6-1-2-7-13(12)20(17)25/h1-9,23H,22H2,(H,26,27,28)/p-1
n/an/a>1.00E+4n/an/an/an/an/an/a
University of Bonn
Curated by ChEMBL
Assay Description
Antagonist activity against rat P2X4 receptor expressed in Xenopus laevis oocyte assessed as inhibition of alpha, beta-meATP-induced inward current b...
J Med Chem 54: 817-30 (2012)
Article DOI: 10.1021/jm1012193
BindingDB Entry DOI: 10.7270/Q2VH5PTG