BDBM50336914 3-[(21S,22S)-16-ethenyl-11-ethyl-12,17,21,26-tetramethyl-4-oxo-7,23,24,25-tetraazahexacyclo[18.2.1.1^{5,8}.1^{10,13}.1^{15,18}.0^{2,6}]hexacosa-1,5,8(26),9,11,13(25),14,16,18,20(23)-decaen-22-yl]-N-(6-{[1-(2-iodophenyl)isoquinolin-3-yl]formamido}hexyl)propanamide::CHEMBL1672413
SMILES: CCc1c(C)c2cc3[nH]c(cc4[nH]c(c(CCC(=O)NCCCCCCNC(=O)c5cc6ccccc6c(n5)-c5ccccc5I)c4C)c4cc(O)c5c(C)c(cc1[nH]2)[nH]c45)c(C)c3C=C
InChI Key: InChIKey=MKFYYJFWKGZMFJ-CHMUXMOUSA-N
Data: 1 IC50  1 Kd
Activity Spreadsheet -- Enzyme Inhibition Constant Data from BindingDB
Found 2 hits for monomerid = 50336914
Trg + Lig
Ki
nM
ΔG°
kcal/mole
IC50
nM
Kd
nM
EC50/IC50
nM
koff
s-1
kon
M-1s-1
pHTemp
°C
Translocator protein
(Homo sapiens (Human))
BDBM50336914
(3-[(21S,22S)-16-ethenyl-11-ethyl-12,17,21,26-tetra...)
Show SMILES CCc1c(C)c2cc3[nH]c(cc4[nH]c(c(CCC(=O)NCCCCCCNC(=O)c5cc6ccccc6c(n5)-c5ccccc5I)c4C)c4cc(O)c5c(C)c(cc1[nH]2)[nH]c45)c(C)c3C=C
Show InChI InChI=1S/C55H56IN7O3/c1-7-35-30(3)42-27-44-32(5)37(52(61-44)40-26-49(64)51-33(6)45(62-54(40)51)29-47-36(8-2)31(4)43(60-47)28-46(35)59-42)21-22-50(65)57-23-15-9-10-16-24-58-55(66)48-25-34-17-11-12-18-38(34)53(63-48)39-19-13-14-20-41(39)56/h7,11-14,17-20,25-29,59-62,64H,1,8-10,15-16,21-24H2,2-6H3,(H,57,65)(H,58,66)/b42-27-,43-28-,44-27-,45-29-,46-28-,47-29-,52-40-
n/an/an/a 40n/an/an/an/an/a
TBA
Curated by ChEMBL
Assay Description
Binding affinity to PBR
ACS Med Chem Lett 2: 136-141 (2011)
Article DOI: 10.1021/ml100211g
BindingDB Entry DOI: 10.7270/Q2F76DJG
Translocator protein
(Homo sapiens (Human))
BDBM50336914
(3-[(21S,22S)-16-ethenyl-11-ethyl-12,17,21,26-tetra...)
Show SMILES CCc1c(C)c2cc3[nH]c(cc4[nH]c(c(CCC(=O)NCCCCCCNC(=O)c5cc6ccccc6c(n5)-c5ccccc5I)c4C)c4cc(O)c5c(C)c(cc1[nH]2)[nH]c45)c(C)c3C=C
Show InChI InChI=1S/C55H56IN7O3/c1-7-35-30(3)42-27-44-32(5)37(52(61-44)40-26-49(64)51-33(6)45(62-54(40)51)29-47-36(8-2)31(4)43(60-47)28-46(35)59-42)21-22-50(65)57-23-15-9-10-16-24-58-55(66)48-25-34-17-11-12-18-38(34)53(63-48)39-19-13-14-20-41(39)56/h7,11-14,17-20,25-29,59-62,64H,1,8-10,15-16,21-24H2,2-6H3,(H,57,65)(H,58,66)/b42-27-,43-28-,44-27-,45-29-,46-28-,47-29-,52-40-
n/an/a 310n/an/an/an/an/an/a
TBA
Curated by ChEMBL
Assay Description
Displacement of [3H]-PK11195 from PBR after 1 hr by scintillation counting
ACS Med Chem Lett 2: 136-141 (2011)
Article DOI: 10.1021/ml100211g
BindingDB Entry DOI: 10.7270/Q2F76DJG