BDBM50336935 CHEMBL1672544::N-(3-(4-cyanophenyl)-1-ethyl-1H-indol-6-yl)methanesulfonamide
SMILES: CCn1cc(-c2ccc(cc2)C#N)c2ccc(NS(C)(=O)=O)cc12
InChI Key: InChIKey=LSQKEQHYMWDEPS-UHFFFAOYSA-N
Data: 4 KI  2 IC50
Activity Spreadsheet -- Enzyme Inhibition Constant Data from BindingDB
Found 6 hits for monomerid = 50336935
Trg + Lig
Ki
nM
ΔG°
kcal/mole
IC50
nM
Kd
nM
EC50/IC50
nM
koff
s-1
kon
M-1s-1
pHTemp
°C
Progesterone receptor
(Homo sapiens (Human))
BDBM50336935
(CHEMBL1672544 | N-(3-(4-cyanophenyl)-1-ethyl-1H-in...)
Show SMILES CCn1cc(-c2ccc(cc2)C#N)c2ccc(NS(C)(=O)=O)cc12
Show InChI InChI=1S/C18H17N3O2S/c1-3-21-12-17(14-6-4-13(11-19)5-7-14)16-9-8-15(10-18(16)21)20-24(2,22)23/h4-10,12,20H,3H2,1-2H3
4.23n/an/an/an/an/an/an/an/a
TBA
Curated by ChEMBL
Assay Description
Displacement of [3H]methyltrienolone from human progesterone receptor expressed in HEK293 cells
ACS Med Chem Lett 2: 148-153 (2011)
Article DOI: 10.1021/ml100220b
BindingDB Entry DOI: 10.7270/Q2Z038G1
Glucocorticoid receptor
(Homo sapiens (Human))
BDBM50336935
(CHEMBL1672544 | N-(3-(4-cyanophenyl)-1-ethyl-1H-in...)
Show SMILES CCn1cc(-c2ccc(cc2)C#N)c2ccc(NS(C)(=O)=O)cc12
Show InChI InChI=1S/C18H17N3O2S/c1-3-21-12-17(14-6-4-13(11-19)5-7-14)16-9-8-15(10-18(16)21)20-24(2,22)23/h4-10,12,20H,3H2,1-2H3
927n/an/an/an/an/an/an/an/a
TBA
Curated by ChEMBL
Assay Description
Displacement of [3H]methyltrienolone from human glucocorticoid receptor expressed in HEK293 cells
ACS Med Chem Lett 2: 148-153 (2011)
Article DOI: 10.1021/ml100220b
BindingDB Entry DOI: 10.7270/Q2Z038G1
Mineralocorticoid receptor
(Homo sapiens (Human))
BDBM50336935
(CHEMBL1672544 | N-(3-(4-cyanophenyl)-1-ethyl-1H-in...)
Show SMILES CCn1cc(-c2ccc(cc2)C#N)c2ccc(NS(C)(=O)=O)cc12
Show InChI InChI=1S/C18H17N3O2S/c1-3-21-12-17(14-6-4-13(11-19)5-7-14)16-9-8-15(10-18(16)21)20-24(2,22)23/h4-10,12,20H,3H2,1-2H3
1.77E+3n/an/an/an/an/an/an/an/a
TBA
Curated by ChEMBL
Assay Description
Displacement of [3H]methyltrienolone from human mineralocorticoid receptor expressed in HEK293 cells
ACS Med Chem Lett 2: 148-153 (2011)
Article DOI: 10.1021/ml100220b
BindingDB Entry DOI: 10.7270/Q2Z038G1
Androgen Receptor
(Homo sapiens (Human))
BDBM50336935
(CHEMBL1672544 | N-(3-(4-cyanophenyl)-1-ethyl-1H-in...)
Show SMILES CCn1cc(-c2ccc(cc2)C#N)c2ccc(NS(C)(=O)=O)cc12
Show InChI InChI=1S/C18H17N3O2S/c1-3-21-12-17(14-6-4-13(11-19)5-7-14)16-9-8-15(10-18(16)21)20-24(2,22)23/h4-10,12,20H,3H2,1-2H3
NCI pathway
Reactome pathway
2.59E+3n/an/an/an/an/an/an/an/a
TBA
Curated by ChEMBL
Assay Description
Displacement of [3H]methyltrienolone from human androgen receptor expressed in HEK293 cells
ACS Med Chem Lett 2: 148-153 (2011)
Article DOI: 10.1021/ml100220b
BindingDB Entry DOI: 10.7270/Q2Z038G1
Mineralocorticoid receptor
(Homo sapiens (Human))
BDBM50336935
(CHEMBL1672544 | N-(3-(4-cyanophenyl)-1-ethyl-1H-in...)
Show SMILES CCn1cc(-c2ccc(cc2)C#N)c2ccc(NS(C)(=O)=O)cc12
Show InChI InChI=1S/C18H17N3O2S/c1-3-21-12-17(14-6-4-13(11-19)5-7-14)16-9-8-15(10-18(16)21)20-24(2,22)23/h4-10,12,20H,3H2,1-2H3
n/an/a>1.00E+4n/an/an/an/an/an/a
TBA
Curated by ChEMBL
Assay Description
Antagonist activity at human mineralocorticoid receptor expressed in HEK293 cells assessed as inhibition of R5050-induced transcriptional activity by...
ACS Med Chem Lett 2: 148-153 (2011)
Article DOI: 10.1021/ml100220b
BindingDB Entry DOI: 10.7270/Q2Z038G1
Progesterone receptor
(Homo sapiens (Human))
BDBM50336935
(CHEMBL1672544 | N-(3-(4-cyanophenyl)-1-ethyl-1H-in...)
Show SMILES CCn1cc(-c2ccc(cc2)C#N)c2ccc(NS(C)(=O)=O)cc12
Show InChI InChI=1S/C18H17N3O2S/c1-3-21-12-17(14-6-4-13(11-19)5-7-14)16-9-8-15(10-18(16)21)20-24(2,22)23/h4-10,12,20H,3H2,1-2H3
n/an/a 12.6n/an/an/an/an/an/a
TBA
Curated by ChEMBL
Assay Description
Antagonist activity at human progesterone receptor expressed in HEK293 cells assessed as inhibition of R5050-induced transcriptional activity by GRE-...
ACS Med Chem Lett 2: 148-153 (2011)
Article DOI: 10.1021/ml100220b
BindingDB Entry DOI: 10.7270/Q2Z038G1